program: Gaussian 09
title: 000069505
version: EM64L-G09RevD.01
frameworkgroup: C1[X(C9H12O4)]
method: RPBEPBE
basis: SDD
operation: Freq
keyword: #pfreq=noraman
keyword: PBEPBE/SDD
title: #p freq=noraman PBEPBE/SDD
converged: YES YES NO NO
title: Mulliken charges:
elementType: O O O O C C C C C C C C C H H H H H H H H H H H H
charge: -0.294350 -0.285808 -0.287360 -0.445497 0.040159 0.318411 0.301625 -0.518235 -0.558466 0.349099 -0.521324 -0.532954 -0.498738 0.264587 0.246851 0.261517 0.199420 0.227903 0.230267 0.222110 0.241931 0.253922 0.204253 0.224578 0.356097
chargesum: 0.00000
title: Mulliken charges with hydrogens summed into heavy atoms:
elementType: O O O O C C C C C C C C C
charge: -0.294350 -0.285808 -0.287360 -0.089400 0.040159 0.318411 0.301625 -0.253647 -0.311614 0.349099 0.167516 0.161354 0.184015
polarizability: 1.45090873e+02 -1.24804920e+00 1.40104454e+02 1.11518794e+00 -4.98297091e-01 6.18570490e+01
1716.lowfreq: -5.0511 0.0006 0.0011 0.0011 5.1436 10.9025 41.5149 78.1451 99.5046
frequency: 41.4664 78.1437 99.5008 119.0677 155.7303 174.6437 189.0960 195.7893 220.3893 239.8513 241.1929 270.2606 307.1102 341.1969 348.6267 388.7141 408.6682 468.8449 498.0275 537.4622 577.1442 608.4602 659.2522 708.2709 740.0841 799.5416 826.2589 868.5052 929.5195 946.9519 1019.0086 1072.9755 1107.9401 1108.6132 1112.4388 1118.5300 1149.2141 1153.2026 1158.3065 1174.1359 1186.6679 1218.4492 1327.4948 1381.3545 1418.2777 1419.1388 1441.8154 1449.4039 1451.0518 1458.1322 1465.1968 1469.7177 1473.6185 1483.1017 1484.1746 1604.6518 1613.9446 2958.9754 2964.5462 2977.8137 3054.7799 3071.1455 3087.5847 3118.8535 3124.7269 3124.8950 3149.1421 3188.7751 3588.6407
redmass: 3.0069 3.4611 3.8616 1.7883 1.4681 1.5380 2.4863 2.0060 2.9987 3.3986 3.1330 1.7828 5.3977 4.0848 1.1388 4.6993 5.7872 5.7215 5.9566 7.2998 3.9772 3.2159 4.1988 4.3828 3.7305 1.5024 2.0377 7.7373 7.8458 8.9851 4.2896 5.0172 1.2497 1.2557 1.2673 2.1646 1.3854 1.3504 1.5960 1.4018 2.3690 1.7425 5.4777 6.5324 1.2507 1.5123 1.2353 1.2007 1.1074 1.6085 1.0515 1.0624 1.3148 1.2204 1.5801 7.6470 6.6595 1.0367 1.0326 1.0346 1.1040 1.0945 1.0967 1.1043 1.1003 1.1055 1.0920 1.0915 1.0660
irintensity: 4.3625 0.9247 13.0446 1.5934 0.3941 2.4840 3.5028 0.0439 1.8069 4.0281 6.8184 2.3569 4.4030 9.3822 139.2069 3.7330 7.8014 5.6427 7.8725 4.1265 1.6672 16.2165 8.8652 9.1318 20.5534 2.7254 72.2240 12.4551 27.8507 44.5911 76.2746 222.7249 9.6703 3.0724 1.9362 79.3390 85.9949 10.3883 52.3237 38.4815 98.4621 105.3716 23.2824 22.8201 12.7324 51.4061 3.1193 54.3302 23.9860 49.2380 13.1346 32.7516 36.5648 51.2633 58.0539 180.3563 129.4119 87.2205 58.4680 77.2273 42.8716 38.1187 47.1823 18.4030 16.6903 26.3780 4.9523 1.3607 38.7488
temp: 298.150 k
press: 1.00000 atm
elementType: 8 8 8 8 6 6 6 6 6 6 6 6 6 1 1 1 1 1 1 1 1 1 1 1 1
symmnumber: 1
zpe: 513905.0 jmol-1
zpe.correction: 0.195736 hartree
zpe.thermalcorrener: 0.209768 hartree
zpe.thermalcorrenthalpy: 0.210712 hartree
zpe.thermalcorrgfe: 0.155393 hartree
zpe.sumelectzpe: -649.988439 hartree
zpe.sumelectthermal: -649.974407 hartree
zpe.sumelectthermalent: -649.973463 hartree
zpe.sumelectthermalfe: -650.028782 hartree
dipole: 0.0949 1.0925 1.7508
dipole: 2.0659
quadrupole: -67.3973 -64.7986 -80.1438
quadrupole: 2.8561 -3.9968 1.7537
quadrupole: 3.3826 5.9813 -9.3639 2.8561 -3.9968 1.7537
hfenergy: -650.1841753 hartree
pointgroup: C01 [X(C9H12O4)]
dipole: -0.2148111 -0.3324272 0.7099062 debye
dipolederiv: -0.3986712 0.0877758 -0.0597062 0.1794665 -1.2065904 0.211698 -0.0097962 0.0477282 -0.3356903 -1.1811565 -0.4982498 -0.0535753 -0.6675743 -0.7957038 -0.0276814 -0.0546042 0.0090865 -0.2857714 -1.5767312 0.3367566 -0.0603667 0.3013542 -0.4029084 0.0102212 0.0716164 0.015201 -0.3185965 -0.2892485 0.4919899 -0.0278303 0.4561126 -1.3442302 0.0290684 -0.0044481 -0.0017647 -0.4283834 -0.3629779 -0.4116042 0.0723687 -0.4565068 0.6879257 -0.0354737 0.0301305 0.1382229 -0.1392785 0.8354769 0.4419343 0.0180702 0.5990831 0.8338546 0.0409258 0.0093159 -0.0493283 0.1082216 1.4712242 -0.2129774 -0.016976 0.1389132 0.3153068 0.0542858 -0.120882 0.0662173 0.1179797 -0.2027261 -0.0472001 -0.0056838 -0.0473202 -0.6290856 0.0077094 -0.0019254 -0.0003125 -0.2556618 -0.5008521 0.333332 -0.023859 0.1839838 -0.3707335 0.0072673 -0.0312518 0.0024863 -0.2720381 0.5612589 -0.3473059 0.0039611 -0.2945165 1.3553166 -0.0297174 -0.0114639 -0.011682 0.0949859 0.1860719 0.1357842 0.0130982 -0.0236865 0.5697467 -0.1577795 0.0854651 -0.2789117 0.4351439 0.8409586 0.2287761 0.0290729 -0.0316197 0.1992265 0.0054321 0.0179876 0.019216 0.3159073 0.6267859 -0.1557224 0.0620878 -0.4579361 0.4236296 -0.063706 0.1137724 -0.0687034 0.3238309 -0.0499537 0.0183013 0.0002924 0.0183944 0.1069662 0.0043375 0.0097361 0.0115068 0.1871367 0.0504454 -0.0672321 0.0024232 -0.0662297 -0.0500748 0.0051813 -0.0002593 0.001644 0.1949815 -0.0582381 -0.1283709 0.0730445 -0.0395711 0.0884511 0.0156442 0.030205 0.0401993 0.0582608 0.0240738 -0.0326521 -0.1106785 -0.0610923 0.0072051 -0.0902072 -0.1105218 0.0730549 -0.1613797 0.0527217 0.1277849 0.0207507 0.0945403 -0.1343214 -0.0063082 0.0353751 -0.0335891 0.0651449 -0.0394074 -0.0274185 -0.0239383 0.1186323 0.056392 0.1225527 -0.0738779 0.0706205 -0.0832866 -0.0618777 -0.0207432 0.0319109 0.128491 0.0536699 -0.1047407 0.0859199 -0.0752196 -0.0829744 0.0207704 -0.0678553 -0.0073607 -0.1329024 -0.0981409 -0.0117275 -0.0028138 -0.0057592 0.1207134 0.1057125 -0.004825 -0.0342885 0.1264162 -0.070899 -0.0680473 -0.0266685 -0.0859899 0.0013019 0.0422719 -0.0062949 0.1044404 0.1232794 0.0020614 0.0714673 -0.0231336 0.0946909 -0.1544383 -0.201272 -0.0230999 -0.018358 -0.0791797 0.0471012 0.0113636 -0.0262065 0.0163887 0.1125656 0.1053405 -0.1508834 0.0111003 -0.1105319 0.3558347 -0.0017657 0.008329 0.0049972 0.3813251 unknown
polarizability: 143.5902385|-2.3725114|141.1012468|2.9454622|-5.8225761|62.3608902 unknown
InChI: InChI=1S/C9H12O4/c1-11-7-4-6(10)5-8(12-2)9(7)13-3/h4-5,10H,1-3H3
charge 0 multiplicity 1
25 atoms
O  0.895182 -1.770572 -0.119057
O  -1.840546 -1.413367 0.035087
O  2.616209 0.638954 -0.055311
O  -1.317923 3.428755 0.021467
C  0.358676 -0.470826 0.026342
C  -1.055795 -0.248222 0.046817
C  1.218298 0.662314 0.007897
C  -1.599252 1.051984 0.054703
C  0.675908 1.974729 -0.002095
C  -0.716695 2.154708 0.021626
C  0.644875 -2.706796 0.997079
C  -3.292726 -1.246567 -0.064182
C  3.380144 -0.541723 0.381474
H  -2.674198 1.241073 0.07106
H  1.376552 2.816535 -0.019385
H  -0.437517 -2.868814 1.130396
H  1.091221 -2.323075 1.937046
H  1.138446 -3.646365 0.703189
H  -3.56748 -0.694752 -0.983243
H  -3.7001 -0.720614 0.820897
H  -3.695805 -2.269146 -0.107695
H  3.25714 -1.379858 -0.32118
H  3.07208 -0.861285 1.395542
H  4.425411 -0.194624 0.402973
H  -0.628407 4.136854 -0.011946
