program: Orca
programVersion: 5.0.2
elementType: O O O C C C C C C C C C C C C C C C C C C C H H H H H H H H H H H H H H H H H H H H H H H H
charge: 0
multiplicity: 1
keywords: wb97x-d3
keywords: def2-TZVPP
keywords: def2/J RIJCOSX
keywords: DEFGRID2
keywords: scfconv7
keywords: smallprint printgap noloewdin
keywords: NOSOSCF
formula: C19H24O3
InChI: InChI=1/C19H24O3/c1-7-8-13-12(4)16(10-15(13)20)22-18(21)17-14(9-11(2)3)19(17,5)6/h1,9,14,16-17H,8,10H2,2-6H3
46 atoms
O  0.374305 -1.508017 -0.103392
O  0.084406 0.656509 -0.596692
O  4.254864 0.298341 -2.140198
C  -2.587723 0.065766 0.996181
C  -2.872131 0.250901 -0.461898
C  -1.797914 -0.718887 -0.046356
C  -1.942298 1.193259 1.762537
C  -3.544726 -0.747865 1.829513
C  -4.109165 -0.270223 -1.100029
C  -0.377746 -0.418666 -0.290365
C  -5.267928 0.391815 -1.146094
C  1.794555 -1.417009 -0.205149
C  -6.472107 -0.185222 -1.823895
C  -5.464596 1.742709 -0.531363
C  2.360869 -1.119248 -1.589822
C  2.413256 -0.389391 0.708057
C  3.375269 0.300992 0.078469
C  3.448736 -0.106702 -1.324618
C  2.004263 -0.291788 2.128497
C  4.295354 1.329303 0.664113
C  5.469548 0.717578 1.273526
C  6.421497 0.19198 1.786246
H  -2.498914 1.1873 -0.868716
H  -2.050132 -1.772689 -0.099267
H  -1.290374 0.812673 2.551928
H  -2.716951 1.79423 2.242804
H  -1.358306 1.862225 1.134236
H  -4.374596 -0.12561 2.171957
H  -3.041765 -1.143556 2.713848
H  -3.966267 -1.589521 1.280971
H  -4.053351 -1.253292 -1.558633
H  2.125268 -2.402541 0.129854
H  1.623151 -0.694351 -2.272461
H  2.77086 -2.0057 -2.07418
H  -6.814065 0.462111 -2.635417
H  -6.276196 -1.173173 -2.240077
H  -7.308887 -0.271235 -1.126017
H  -5.770762 2.471938 -1.285798
H  -6.267643 1.713595 0.209464
H  -4.571573 2.12448 -0.039078
H  1.872917 -1.283857 2.562136
H  1.044267 0.222748 2.220136
H  2.729712 0.254807 2.727514
H  4.614448 2.026813 -0.113859
H  3.771448 1.925861 1.413534
H  7.271685 -0.268268 2.236777
elementType: O C H
totalener: -964.16039800 hartree
nucrepener: 1772.66930676 hartree
electener: -2736.82970476 hartree
oneelecener: -4830.33452532 hartree
twoeener: 2093.50482056 hartree
cpcmener: -0.04164363 hartree
kineticenergy: 959.78297185 hartree
xcener: -94.701936264471 hartree
chargesum: 0.0000000
charge: -0.298603 -0.489956 -0.486558 0.127316 -0.016816 -0.098528 -0.317543 -0.278425 -0.254870 0.400075 -0.042843 0.278102 -0.230602 -0.249055 -0.147661 0.007616 -0.137603 0.310653 -0.263099 -0.125721 -0.449332 0.038433 0.102197 0.094133 0.103248 0.105444 0.099344 0.098309 0.102361 0.093284 0.122235 0.122140 0.114936 0.109018 0.095820 0.090536 0.094260 0.103702 0.097865 0.087348 0.117061 0.124710 0.105320 0.117708 0.132445 0.291596
qa: -0.2986 -0.4900 -0.4866 0.1273 -0.0168 -0.0985 -0.3175 -0.2784 -0.2549 0.4001 -0.0428 0.2781 -0.2306 -0.2491 -0.1477 0.0076 -0.1376 0.3107 -0.2631 -0.1257 -0.4493 0.0384 0.1022 0.0941 0.1032 0.1054 0.0993 0.0983 0.1024 0.0933 0.1222 0.1221 0.1149 0.1090 0.0958 0.0905 0.0943 0.1037 0.0979 0.0873 0.1171 0.1247 0.1053 0.1177 0.1324 0.2916
va: 2.1320 2.0169 2.0106 3.6498 3.8207 3.8374 3.8954 3.9061 3.8512 4.1900 3.7145 3.7785 3.9275 3.9331 3.8790 3.6533 3.5281 4.0472 3.9507 3.8948 3.8201 3.5372 1.0238 1.0363 0.9996 1.0025 1.0153 0.9994 1.0028 1.0026 1.0059 0.9930 1.0256 1.0233 0.9955 1.0069 0.9963 0.9996 0.9978 1.0082 1.0005 0.9937 1.0011 1.0121 0.9912 0.9440
dispcorr: -0.023082100 hartree
energy: -964.183480097577
dipole: -32.80679 30.33936 -2.46743 2.66764 -3.90505 -1.23740 8.93359 -6.80112 2.13247
magnitude: 3.48810 au
magnitude: 8.86605 debye
