program: Orca
programVersion: 5.0.2
elementType: O O O C C C C C C C C C C C C C C C C C C C H H H H H H H H H H H H H H H H H H H H H H H H
charge: 0
multiplicity: 1
keywords: wb97x-d3
keywords: def2-TZVPP
keywords: def2/J RIJCOSX
keywords: DEFGRID2
keywords: scfconv7
keywords: smallprint printgap noloewdin
keywords: NOSOSCF
formula: C19H24O3
InChI: InChI=1/C19H24O3/c1-7-8-13-12(4)16(10-15(13)20)22-18(21)17-14(9-11(2)3)19(17,5)6/h1,9,14,16-17H,8,10H2,2-6H3
46 atoms
O  0.40852 -0.95261 -0.169524
O  -0.614592 -0.394365 1.746331
O  4.917094 -1.611633 -0.968156
C  -3.104368 -1.606192 0.220952
C  -3.169761 -0.110643 0.216964
C  -1.896091 -0.803879 -0.235281
C  -3.099965 -2.315395 1.552297
C  -3.808622 -2.391114 -0.85939
C  -3.955647 0.656668 -0.767789
C  -0.672017 -0.690519 0.574447
C  -4.724937 1.721106 -0.515165
C  1.711501 -0.860559 0.412309
C  -5.462238 2.411122 -1.623527
C  -4.933704 2.328642 0.838193
C  2.634646 -1.909331 -0.191619
C  2.352331 0.464367 0.07664
C  3.568938 0.294906 -0.46266
C  3.864601 -1.133697 -0.593271
C  1.677427 1.744136 0.393063
C  4.547509 1.357311 -0.865199
C  5.25213 1.918559 0.281179
C  5.817743 2.391605 1.230589
H  -3.099667 0.329912 1.205454
H  -1.721455 -0.827817 -1.305104
H  -2.693517 -1.711973 2.360697
H  -2.529408 -3.244742 1.500945
H  -4.124248 -2.575354 1.825731
H  -4.867165 -2.505722 -0.618239
H  -3.378982 -3.390985 -0.941956
H  -3.738733 -1.924053 -1.840612
H  -3.889924 0.318445 -1.797776
H  1.647388 -0.971927 1.496671
H  2.19454 -2.361122 -1.083909
H  2.881302 -2.716351 0.497678
H  -5.17012 3.462292 -1.692594
H  -5.280173 1.946762 -2.592419
H  -6.539986 2.40309 -1.441747
H  -4.584028 3.364095 0.850924
H  -5.998976 2.362073 1.079229
H  -4.430511 1.798715 1.644182
H  1.474112 1.810412 1.46382
H  0.714432 1.816104 -0.116927
H  2.273953 2.607077 0.10477
H  5.276316 0.942428 -1.564999
H  4.034933 2.160668 -1.399274
H  6.320537 2.81332 2.071551
elementType: O C H
totalener: -964.16433743 hartree
nucrepener: 1736.12981942 hartree
electener: -2700.29415685 hartree
oneelecener: -4756.86918117 hartree
twoeener: 2056.57502431 hartree
cpcmener: -0.03915464 hartree
kineticenergy: 959.76107420 hartree
xcener: -94.696953151583 hartree
chargesum: -0.0000000
charge: -0.294546 -0.496126 -0.481252 0.101187 0.044253 -0.102784 -0.275113 -0.271798 -0.284478 0.408979 -0.049185 0.253283 -0.218247 -0.252950 -0.138026 -0.027906 -0.095289 0.318705 -0.240990 -0.112401 -0.458609 0.045608 0.093468 0.089266 0.090069 0.099659 0.097383 0.098114 0.098020 0.089505 0.121435 0.107510 0.104962 0.100924 0.093191 0.089224 0.093752 0.097262 0.095784 0.089887 0.118404 0.116798 0.101954 0.114340 0.135091 0.291687
qa: -0.2945 -0.4961 -0.4813 0.1012 0.0443 -0.1028 -0.2751 -0.2718 -0.2845 0.4090 -0.0492 0.2533 -0.2182 -0.2529 -0.1380 -0.0279 -0.0953 0.3187 -0.2410 -0.1124 -0.4586 0.0456 0.0935 0.0893 0.0901 0.0997 0.0974 0.0981 0.0980 0.0895 0.1214 0.1075 0.1050 0.1009 0.0932 0.0892 0.0938 0.0973 0.0958 0.0899 0.1184 0.1168 0.1020 0.1143 0.1351 0.2917
va: 2.1270 2.0024 2.0164 3.6997 3.7674 3.8514 3.9062 3.9102 3.8759 4.1561 3.7600 3.7500 3.9190 3.9409 3.9247 3.7619 3.5245 4.0308 3.9349 3.8804 3.8225 3.5295 1.0317 1.0378 1.0187 0.9993 0.9997 1.0013 1.0018 1.0062 1.0106 1.0307 1.0273 1.0238 0.9962 1.0087 0.9963 0.9964 0.9972 1.0104 1.0025 1.0009 1.0035 1.0156 0.9892 0.9438
dispcorr: -0.020762091 hartree
energy: -964.185099525295
dipole: -32.90785 30.52531 -2.38254 5.47689 -4.70306 0.77384 -0.68962 0.25328 -0.43634
magnitude: 2.54278 au
magnitude: 6.46323 debye
