program: Orca
programVersion: 5.0.2
elementType: O O O C C C C C C C C C C C C C C C C C C C H H H H H H H H H H H H H H H H H H H H H H H H
charge: 0
multiplicity: 1
keywords: wb97x-d3
keywords: def2-TZVPP
keywords: def2/J RIJCOSX
keywords: DEFGRID2
keywords: scfconv7
keywords: smallprint printgap noloewdin
keywords: NOSOSCF
formula: C19H24O3
InChI: InChI=1/C19H24O3/c1-7-8-13-12(4)16(10-15(13)20)22-18(21)17-14(9-11(2)3)19(17,5)6/h1,9,14,16-17H,8,10H2,2-6H3
46 atoms
O  0.415171 -1.011141 -0.178729
O  -0.583171 -0.4718 1.754659
O  4.9278 -1.545741 -1.051915
C  -3.11929 -1.629094 0.29376
C  -3.139925 -0.133846 0.236251
C  -1.892707 -0.884165 -0.20752
C  -3.121399 -2.292515 1.648988
C  -3.859236 -2.432039 -0.749251
C  -3.916488 0.625204 -0.761407
C  -0.65696 -0.762882 0.582257
C  -4.586172 1.764187 -0.551804
C  1.724382 -0.900018 0.385346
C  -5.337508 2.424631 -1.669024
C  -4.673601 2.48631 0.757696
C  2.662621 -1.912717 -0.255639
C  2.330218 0.44687 0.071556
C  3.544877 0.317646 -0.482973
C  3.869736 -1.100434 -0.653594
C  1.631577 1.705097 0.421528
C  4.493264 1.412324 -0.871269
C  5.16757 1.995239 0.282603
C  5.706177 2.486353 1.238492
H  -3.036897 0.337651 1.207355
H  -1.733552 -0.950612 -1.277814
H  -2.564912 -3.231473 1.62826
H  -4.148831 -2.528345 1.932366
H  -2.705048 -1.667976 2.435783
H  -4.919672 -2.497788 -0.498496
H  -3.466399 -3.449419 -0.790852
H  -3.778358 -2.01013 -1.749914
H  -3.937522 0.210183 -1.764844
H  1.679682 -1.037529 1.467747
H  2.221444 -2.351378 -1.153982
H  2.935386 -2.73141 0.409688
H  -4.952429 3.430192 -1.857585
H  -5.276579 1.860099 -2.599046
H  -6.393697 2.54364 -1.413774
H  -5.708511 2.515251 1.10909
H  -4.070041 2.048323 1.550023
H  -4.361869 3.527343 0.640761
H  0.659752 1.765077 -0.072953
H  2.20462 2.586025 0.140117
H  1.443417 1.747889 1.49619
H  5.241963 1.023307 -1.564953
H  3.960266 2.200385 -1.408411
H  6.204966 2.90942 2.081326
elementType: O C H
totalener: -964.16425074 hartree
nucrepener: 1738.63039208 hartree
electener: -2702.79464282 hartree
oneelecener: -4761.87680125 hartree
twoeener: 2059.08215843 hartree
cpcmener: -0.03891119 hartree
kineticenergy: 959.75696352 hartree
xcener: -94.696338849186 hartree
chargesum: -0.0000000
charge: -0.295534 -0.496641 -0.481136 0.101691 0.035183 -0.092784 -0.276097 -0.274706 -0.279772 0.405512 -0.052505 0.255644 -0.216921 -0.253093 -0.138178 -0.027087 -0.096070 0.317467 -0.242792 -0.110917 -0.459275 0.046082 0.097030 0.089079 0.099963 0.097037 0.090510 0.098223 0.097847 0.090194 0.120835 0.107431 0.105103 0.100955 0.094225 0.088762 0.092841 0.098510 0.090809 0.094481 0.117108 0.101553 0.118880 0.113594 0.135480 0.291480
qa: -0.2955 -0.4966 -0.4811 0.1017 0.0352 -0.0928 -0.2761 -0.2747 -0.2798 0.4055 -0.0525 0.2556 -0.2169 -0.2531 -0.1382 -0.0271 -0.0961 0.3175 -0.2428 -0.1109 -0.4593 0.0461 0.0970 0.0891 0.1000 0.0970 0.0905 0.0982 0.0978 0.0902 0.1208 0.1074 0.1051 0.1010 0.0942 0.0888 0.0928 0.0985 0.0908 0.0945 0.1171 0.1016 0.1189 0.1136 0.1355 0.2915
va: 2.1271 2.0014 2.0165 3.6956 3.7767 3.8419 3.9044 3.9127 3.8752 4.1561 3.7646 3.7488 3.9186 3.9396 3.9250 3.7611 3.5269 4.0306 3.9352 3.8802 3.8230 3.5280 1.0276 1.0369 0.9991 0.9997 1.0190 1.0010 1.0014 1.0066 1.0111 1.0303 1.0272 1.0237 0.9964 1.0088 0.9959 0.9964 1.0108 0.9970 1.0007 1.0035 1.0026 1.0163 0.9890 0.9439
dispcorr: -0.020782938 hartree
energy: -964.185033678491
dipole: -32.54447 30.14778 -2.39669 5.72175 -4.97901 0.74274 -0.41220 0.01685 -0.39535
magnitude: 2.54010 au
magnitude: 6.45642 debye
