program: Gaussian 09
title: 000069502
version: EM64L-G09RevD.01
frameworkgroup: C1[X(C16H14O4)]
method: RPBEPBE
basis: SDD
operation: Freq
keyword: #pfreq=noraman
keyword: PBEPBE/SDD
title: #p freq=noraman PBEPBE/SDD
converged: YES YES NO NO
title: Mulliken charges:
elementType: O O O O C C C C C C C C C C C C C C C C H H H H H H H H H H H H H H
charge: -0.205511 -0.294618 -0.387485 -0.195908 0.380799 0.088100 0.340976 -0.656640 0.046758 0.018882 -0.100767 -0.374895 -0.276390 -0.289468 -0.177476 0.371773 -0.327269 0.128205 -0.781238 -0.798754 0.230610 0.222419 0.263914 0.269202 0.241229 0.268609 0.250355 0.395849 0.231985 0.218456 0.219775 0.224956 0.221046 0.232521
chargesum: 0.00000
title: Mulliken charges with hydrogens summed into heavy atoms:
elementType: O O O O C C C C C C C C C C C C C C C C
charge: -0.205511 -0.294618 0.008364 -0.195908 0.380799 0.088100 0.340976 -0.203611 0.046758 0.018882 -0.100767 -0.110982 -0.007188 -0.048239 0.091133 0.371773 -0.076914 0.128205 -0.111023 -0.120230
polarizability: 2.30969420e+02 1.40535932e+01 2.71213949e+02 -1.30044351e+01 1.68720650e+00 1.01599144e+02
1716.lowfreq: -5.8018 -0.0007 0.0002 0.0004 3.3667 5.6220 27.1573 35.9555 55.4446
frequency: 26.9938 35.8778 55.4268 70.0896 107.5600 137.3745 147.6706 169.0866 184.9507 191.2884 198.6407 211.3909 254.2508 279.0663 299.2022 310.4069 359.5918 377.2312 389.7259 404.9205 435.3136 442.7206 479.4692 496.9120 506.7586 540.9246 565.6721 576.0153 617.4316 625.2641 647.7254 677.0704 703.7424 731.4076 751.0946 757.3295 784.7575 808.4682 835.1971 848.7069 852.6433 864.4903 917.6671 948.3036 960.4350 972.3940 983.0735 994.3829 996.3646 1025.7426 1041.9164 1081.4258 1081.6939 1107.0760 1118.3597 1135.9369 1175.1388 1194.7111 1226.4997 1241.8326 1250.2712 1283.3060 1308.0081 1336.7554 1355.2580 1379.0424 1390.8229 1402.2776 1416.7913 1449.2796 1455.4409 1458.6105 1465.7680 1471.2281 1473.7152 1481.1827 1527.5460 1588.4002 1607.1926 1647.5225 1688.8322 1690.4603 2961.1782 2965.3798 2985.5058 3032.9859 3035.7236 3037.5476 3080.8775 3085.5054 3092.7355 3159.6971 3187.4556 3223.5270 3267.7942 3504.6661
redmass: 3.7852 3.9069 3.3413 8.0411 4.3869 1.0824 3.9264 2.0899 3.3605 4.1987 4.7004 3.0723 4.1394 4.5562 4.9667 2.0688 8.5339 4.5349 3.1461 6.6113 4.3576 2.5034 6.3016 2.4031 1.3042 4.4184 4.5875 6.0797 5.6588 5.1846 5.2299 6.0742 5.4307 7.5132 1.6339 2.5671 3.1118 2.8297 1.6531 5.0335 2.0777 1.3995 4.1315 1.3967 2.8519 3.5443 1.3971 1.2752 3.2377 2.2093 3.5585 2.3858 2.1756 2.4637 2.0250 2.1456 1.3704 1.5145 1.8675 2.0033 1.6962 1.4002 3.0824 2.2842 1.4287 3.2367 1.2819 1.2244 5.3071 5.3906 1.0548 5.8830 1.0607 1.0825 1.0671 1.0842 5.7208 8.4093 8.0905 8.1861 6.4994 10.6619 1.0375 1.0380 1.0615 1.0970 1.0964 1.0970 1.0967 1.0980 1.0903 1.0880 1.0966 1.0927 1.1070 1.0650
irintensity: 0.1484 0.2731 0.7862 0.1486 3.4352 0.3893 0.8792 0.9867 2.0038 3.6991 2.6927 0.1617 9.8296 1.8974 0.1455 0.6077 0.2750 1.5373 1.1416 7.4915 2.6760 5.7958 5.5519 54.2392 91.4228 1.1620 2.3545 0.3117 4.5010 2.4662 8.0529 22.1853 0.1659 37.0981 80.4986 5.6045 2.9015 3.4086 38.0603 20.2779 8.0130 4.3387 60.0979 1.0492 40.6563 0.8077 0.4998 0.9869 70.6559 6.6009 28.7718 58.9464 37.1889 65.9667 8.0796 112.2257 6.6381 16.6318 7.6203 90.4133 63.2723 1.5786 6.5622 19.1642 1.8778 2.6457 27.4453 15.0393 108.8119 12.2155 3.4633 69.3864 6.6313 11.3872 27.4292 25.1187 2.1629 149.0221 28.0102 20.0525 27.7220 591.7226 29.5382 50.9484 25.3321 0.0917 47.9287 8.8987 22.7369 31.4660 32.7350 4.5549 3.4238 2.0788 0.3878 85.2837
temp: 298.150 k
press: 1.00000 atm
elementType: 8 8 8 8 6 6 6 6 6 6 6 6 6 6 6 6 6 6 6 6 1 1 1 1 1 1 1 1 1 1 1 1 1 1
symmnumber: 1
zpe: 680143.4 jmol-1
zpe.correction: 0.259053 hartree
zpe.thermalcorrener: 0.277065 hartree
zpe.thermalcorrenthalpy: 0.278009 hartree
zpe.thermalcorrgfe: 0.212495 hartree
zpe.sumelectzpe: -917.547019 hartree
zpe.sumelectthermal: -917.529007 hartree
zpe.sumelectthermalent: -917.528063 hartree
zpe.sumelectthermalfe: -917.593577 hartree
dipole: 5.6734 -3.6394 -1.1202
dipole: 6.8328
quadrupole: -116.3332 -122.5497 -116.6028
quadrupole: 8.4849 -0.2459 -0.6599
quadrupole: 2.1621 -4.0545 1.8924 8.4849 -0.2459 -0.6599
hfenergy: -917.8060719 hartree
pointgroup: C01 [X(C16H14O4)]
dipole: 2.5031193 0.8405199 0.5044699 debye
polarizability: 226.4502251|-3.7773799|275.2446035|14.2759218|5.8251001|102.0876845 unknown
InChI: InChI=1S/C16H14O4/c1-9(2)3-4-10-11-5-6-13(17)20-16(11)14(18)15-12(10)7-8-19-15/h3,5-8,18H,4H2,1-2H3
charge 0 multiplicity 1
34 atoms
O  -1.954941 3.251947 -0.122543
O  -2.356533 -1.584352 -0.268538
O  -3.613075 0.823539 -0.559496
O  -2.595118 -3.879414 -0.348882
C  0.580923 0.674512 0.495022
C  -0.109136 1.9004 0.331156
C  -0.17707 -0.51987 0.285105
C  2.061064 0.644719 0.86282
C  -1.497828 1.929637 -0.020458
C  -1.563327 -0.441591 -0.060602
C  -2.267478 0.775312 -0.223999
C  0.287154 3.301341 0.443685
C  0.37107 -1.858129 0.399465
C  2.958113 0.271341 -0.312187
C  -0.825594 4.062354 0.169673
C  3.981884 -0.63078 -0.327835
C  -0.393905 -2.987188 0.198134
C  -1.811106 -2.934232 -0.147402
C  4.783402 -0.869014 -1.598105
C  4.426817 -1.461478 0.86388
H  2.347564 1.650095 1.227928
H  2.23015 -0.040679 1.713469
H  1.273452 3.688039 0.690983
H  1.431768 -1.970078 0.642316
H  2.736477 0.81689 -1.241522
H  -1.013144 5.131833 0.130502
H  0.028359 -3.991357 0.285306
H  -3.952236 -0.107208 -0.654847
H  4.43402 -0.234128 -2.430186
H  5.859324 -0.660746 -1.434144
H  4.711845 -1.927253 -1.919685
H  3.801354 -1.318864 1.760979
H  4.427111 -2.540341 0.610157
H  5.46814 -1.207453 1.144351
