program: Orca
programVersion: 5.0.2
elementType: O O O C C C C C C C C C C C C C C C C C C C H H H H H H H H H H H H H H H H H H H H H H H H
charge: 0
multiplicity: 1
keywords: wb97x-d3
keywords: def2-TZVPP
keywords: def2/J RIJCOSX
keywords: DEFGRID2
keywords: scfconv7
keywords: smallprint printgap noloewdin
keywords: NOSOSCF
formula: C19H24O3
InChI: InChI=1/C19H24O3/c1-7-8-13-12(4)16(10-15(13)20)22-18(21)17-14(9-11(2)3)19(17,5)6/h1,9,14,16-17H,8,10H2,2-6H3
46 atoms
O  0.026518 -0.566976 -0.255804
O  -0.64886 -2.398601 0.844651
O  3.906047 0.321392 -2.534363
C  -2.167725 0.807265 1.4617
C  -2.529193 0.719051 0.016555
C  -2.101633 -0.535501 0.750954
C  -0.908185 1.540246 1.85873
C  -3.268245 0.935941 2.48822
C  -3.928897 0.857248 -0.463853
C  -0.850812 -1.273356 0.472133
C  -4.434615 0.233957 -1.528984
C  1.276825 -1.158974 -0.607918
C  -5.853082 0.447366 -1.961664
C  -3.643927 -0.714022 -2.377559
C  1.73789 -0.615486 -1.95484
C  2.361183 -0.760791 0.366745
C  3.396075 -0.182868 -0.255513
C  3.138883 -0.090187 -1.702978
C  2.228905 -1.042909 1.818365
C  4.676301 0.318853 0.343348
C  4.467717 1.367764 1.333195
C  4.289552 2.225219 2.153466
H  -1.776472 1.121509 -0.655804
H  -2.898652 -1.218555 1.021991
H  -0.489711 1.128895 2.780031
H  -1.13955 2.589771 2.049225
H  -0.135492 1.512862 1.094122
H  -2.933375 0.560693 3.456501
H  -4.164832 0.381271 2.212403
H  -3.552005 1.982171 2.620104
H  -4.569395 1.541435 0.085306
H  1.17103 -2.247001 -0.619276
H  1.100152 0.204497 -2.290826
H  1.742089 -1.365129 -2.746458
H  -6.383014 1.137054 -1.305979
H  -5.898008 0.847358 -2.977541
H  -6.404389 -0.496098 -1.974459
H  -2.613193 -0.82409 -2.047914
H  -4.10238 -1.706107 -2.382081
H  -3.628048 -0.376853 -3.41694
H  3.165074 -0.891412 2.351329
H  1.882113 -2.062581 1.986911
H  1.489739 -0.378528 2.271838
H  5.227009 -0.507078 0.803733
H  5.313338 0.698103 -0.459549
H  4.132634 2.991781 2.873038
totalener: -964.14623313 hartree
nucrepener: 1797.71589703 hartree
electener: -2761.86213016 hartree
oneelecener: -4879.80883630 hartree
twoeener: 2117.94670614 hartree
kineticenergy: 959.81815908 hartree
xcener: -94.697319737276 hartree
chargesum: 0.0000000
charge: -0.272368 -0.361666 -0.329240 0.149553 0.006522 -0.115615 -0.298492 -0.281041 -0.260744 0.324987 -0.001311 0.178507 -0.211043 -0.220274 -0.131811 -0.047501 -0.058171 0.219204 -0.240098 -0.160779 -0.412170 0.090755 0.102184 0.090114 0.092601 0.093813 0.094182 0.093736 0.086112 0.090901 0.094421 0.102408 0.089656 0.090268 0.078974 0.087215 0.086116 0.069002 0.090157 0.091153 0.095980 0.124637 0.104812 0.119555 0.120240 0.244557
qa: -0.2724 -0.3617 -0.3292 0.1496 0.0065 -0.1156 -0.2985 -0.2810 -0.2607 0.3250 -0.0013 0.1785 -0.2110 -0.2203 -0.1318 -0.0475 -0.0582 0.2192 -0.2401 -0.1608 -0.4122 0.0908 0.1022 0.0901 0.0926 0.0938 0.0942 0.0937 0.0861 0.0909 0.0944 0.1024 0.0897 0.0903 0.0790 0.0872 0.0861 0.0690 0.0902 0.0912 0.0960 0.1246 0.1048 0.1196 0.1202 0.2446
va: 2.0651 2.1374 2.1743 3.6820 3.7926 3.8446 3.9000 3.9174 3.9036 4.2205 3.7367 3.7981 3.9422 3.9439 3.8766 3.6737 3.4753 4.1183 3.9547 3.9161 3.8626 3.5795 1.0202 1.0296 0.9975 1.0085 1.0135 1.0056 1.0052 1.0005 1.0097 1.0283 1.0302 1.0270 1.0098 0.9987 0.9990 1.0216 1.0018 1.0014 1.0041 1.0109 0.9981 0.9852 1.0193 0.9735
dispcorr: -0.023463281 hartree
energy: -964.169696412498
dipole: -23.95416 22.92198 -1.03218 4.34884 -4.21009 0.13875 4.39450 -3.78299 0.61151
magnitude: 1.20772 au
magnitude: 3.06979 debye
