program: Orca
programVersion: 5.0.2
elementType: O O O C C C C C C C C C C C C C C C C C C C C C C C H H H H H H H H H H H H H H H H H H H H H H H H H H
charge: 0
multiplicity: 1
keywords: wb97x-d3
keywords: def2-TZVPP
keywords: def2/J RIJCOSX
keywords: DEFGRID2
keywords: scfconv7
keywords: smallprint printgap noloewdin
keywords: NOSOSCF
formula: C23H26O3
InChI: InChI=1/C23H26O3/c1-16(2)13-20-21(23(20,3)4)22(24)25-15-17-9-8-12-19(14-17)26-18-10-6-5-7-11-18/h5-14,20-21H,15H2,1-4H3
52 atoms
O  -1.099221 -0.00724 2.001285
O  -2.690012 1.217352 1.018013
O  3.630238 0.92624 -0.355988
C  -4.105793 -1.465846 0.370257
C  -3.094567 -1.292286 -0.707882
C  -2.670977 -1.166609 0.763642
C  -4.547184 -2.879195 0.672632
C  -5.213888 -0.46086 0.568803
C  -3.088733 -0.117746 -1.615119
C  -2.201636 0.135978 1.255981
C  -1.99785 0.387113 -2.196529
C  -2.070202 1.582455 -3.094959
C  -0.620934 -0.156454 -1.975917
C  -0.411636 1.181343 2.423494
C  0.450981 1.714546 1.314859
C  1.633681 1.048512 1.004944
C  0.07879 2.836887 0.582494
C  2.427591 1.501375 -0.039161
C  0.886005 3.285186 -0.454131
C  2.056384 2.617124 -0.777623
C  3.805582 -0.428837 -0.216042
C  2.862045 -1.342017 -0.669068
C  4.999642 -0.859651 0.341406
C  3.122851 -2.699018 -0.549932
C  5.252424 -2.220768 0.443139
C  4.314969 -3.145178 0.00509
H  -2.728468 -2.21445 -1.15169
H  -2.111929 -2.010417 1.15027
H  -4.903153 -2.965883 1.700801
H  -3.737424 -3.597149 0.537265
H  -5.365454 -3.172574 0.012355
H  -5.520364 -0.431356 1.61579
H  -6.083921 -0.766552 -0.015959
H  -4.96029 0.551267 0.268393
H  -4.045568 0.35337 -1.819749
H  -1.681985 1.355009 -4.090846
H  -1.452292 2.394527 -2.700924
H  -3.088217 1.955631 -3.204701
H  -0.601166 -1.043492 -1.346495
H  0.01622 0.600848 -1.512782
H  -0.148357 -0.409722 -2.927566
H  0.198638 0.861017 3.266596
H  -1.114279 1.933846 2.782121
H  1.932362 0.188283 1.592858
H  -0.833418 3.366243 0.824201
H  0.597938 4.158687 -1.023997
H  2.683165 2.962337 -1.589909
H  1.935602 -1.005919 -1.11664
H  5.726697 -0.136358 0.687283
H  2.387626 -3.410671 -0.901207
H  6.185772 -2.556038 0.875281
H  4.512161 -4.205098 0.092167
elementType: O C H
totalener: -1117.85332690 hartree
nucrepener: 2338.39342816 hartree
electener: -3456.24675506 hartree
oneelecener: -6166.76069256 hartree
twoeener: 2710.51393750 hartree
cpcmener: -0.02992889 hartree
kineticenergy: 1112.81014858 hartree
xcener: -110.231296016516 hartree
chargesum: -0.0000000
charge: -0.295353 -0.493704 -0.342248 0.136763 -0.018985 -0.117370 -0.265071 -0.300186 -0.279032 0.409834 -0.025129 -0.227225 -0.209955 0.080292 -0.005125 -0.206912 -0.186007 0.272984 -0.154128 -0.215752 0.190936 -0.115176 -0.197717 -0.222102 -0.156491 -0.148650 0.113058 0.095129 0.095088 0.087951 0.094820 0.102243 0.099192 0.092157 0.125909 0.098699 0.091721 0.091233 0.098636 0.027051 0.118863 0.125689 0.115228 0.142700 0.141553 0.160141 0.147702 0.198353 0.148462 0.157803 0.161066 0.161064
qa: -0.2954 -0.4937 -0.3422 0.1368 -0.0190 -0.1174 -0.2651 -0.3002 -0.2790 0.4098 -0.0251 -0.2272 -0.2100 0.0803 -0.0051 -0.2069 -0.1860 0.2730 -0.1541 -0.2158 0.1909 -0.1152 -0.1977 -0.2221 -0.1565 -0.1487 0.1131 0.0951 0.0951 0.0880 0.0948 0.1022 0.0992 0.0922 0.1259 0.0987 0.0917 0.0912 0.0986 0.0271 0.1189 0.1257 0.1152 0.1427 0.1416 0.1601 0.1477 0.1984 0.1485 0.1578 0.1611 0.1611
va: 2.1091 1.9912 2.0646 3.7415 3.8114 3.8358 3.9002 3.8904 3.8510 4.1027 3.7262 3.9273 3.9074 3.8142 3.6114 3.9234 3.8591 3.7031 3.8968 3.9393 3.7753 3.8171 3.9632 3.9631 3.9010 3.8669 1.0062 1.0306 1.0026 1.0044 1.0020 1.0002 0.9982 1.0164 0.9983 0.9965 0.9960 1.0072 1.0027 1.0217 1.0017 0.9962 1.0108 1.0090 1.0147 0.9900 1.0055 0.9452 1.0064 0.9949 0.9886 0.9894
dispcorr: -0.028905289 hartree
energy: -1117.882232186881
dipole: -20.65631 20.93381 0.27749 -7.01115 5.82730 -1.18385 -7.73702 7.86081 0.12378
magnitude: 1.22222 au
magnitude: 3.10663 debye
