program: Orca
programVersion: 5.0.2
elementType: O O O C C C C C C C C C C C C C C C C C C C C C C C H H H H H H H H H H H H H H H H H H H H H H H H H H
charge: 0
multiplicity: 1
keywords: wb97x-d3
keywords: def2-TZVPP
keywords: def2/J RIJCOSX
keywords: DEFGRID2
keywords: scfconv7
keywords: smallprint printgap noloewdin
keywords: NOSOSCF
formula: C23H26O3
InChI: InChI=1/C23H26O3/c1-16(2)13-20-21(23(20,3)4)22(24)25-15-17-9-8-12-19(14-17)26-18-10-6-5-7-11-18/h5-14,20-21H,15H2,1-4H3
52 atoms
O  -2.351847 2.131307 -0.556688
O  -2.08372 0.263397 -1.750829
O  2.212539 0.837008 1.039347
C  -4.330787 -0.93823 0.054439
C  -3.073073 -1.132499 0.83006
C  -3.414692 0.252223 0.252305
C  -5.613978 -0.865401 0.85002
C  -4.52814 -1.572804 -1.299869
C  -1.933684 -1.93325 0.332162
C  -2.570337 0.830806 -0.8000
C  -0.792189 -2.145833 0.995784
C  0.277111 -3.027382 0.425515
C  -0.459718 -1.540934 2.324471
C  -1.494238 2.839218 -1.440203
C  -0.033301 2.52243 -1.257565
C  0.443835 1.76808 -0.193346
C  0.868048 3.042093 -2.182819
C  1.807885 1.547058 -0.062185
C  2.228137 2.824595 -2.031778
C  2.713961 2.07884 -0.967749
C  3.146762 -0.157681 0.926827
C  3.337268 -0.895986 -0.235166
C  3.872942 -0.448186 2.07508
C  4.276525 -1.918539 -0.240498
C  4.800195 -1.4789 2.056031
C  5.012289 -2.215709 0.898087
H  -3.201581 -1.1500 1.907407
H  -3.750013 0.976999 0.984463
H  -6.369714 -0.282888 0.320074
H  -5.462039 -0.405537 1.827213
H  -6.018567 -1.866111 1.012411
H  -4.950526 -2.571171 -1.17252
H  -3.62105 -1.674779 -1.887588
H  -5.238876 -0.990986 -1.889166
H  -2.050156 -2.416162 -0.632057
H  0.006369 -3.425206 -0.552347
H  0.483299 -3.871113 1.089262
H  1.218415 -2.48236 0.320515
H  -0.219699 -2.318811 3.053845
H  -1.255358 -0.924765 2.739322
H  0.432037 -0.915018 2.241663
H  -1.669099 3.891114 -1.212839
H  -1.789928 2.681142 -2.47977
H  -0.221329 1.347581 0.551777
H  0.504519 3.624557 -3.020758
H  2.922969 3.240654 -2.749233
H  3.778004 1.917101 -0.853182
H  2.763136 -0.691099 -1.129129
H  3.708024 0.128771 2.976359
H  4.425668 -2.489433 -1.147497
H  5.361457 -1.703058 2.953498
H  5.740662 -3.015302 0.884198
elementType: O C H
totalener: -1117.85384345 hartree
nucrepener: 2330.84776763 hartree
electener: -3448.70161108 hartree
oneelecener: -6152.13256420 hartree
twoeener: 2703.43095312 hartree
cpcmener: -0.03131503 hartree
kineticenergy: 1112.80100480 hartree
xcener: -110.233205344708 hartree
chargesum: -0.0000000
charge: -0.304612 -0.488545 -0.338596 0.132466 -0.023727 -0.066860 -0.258505 -0.295125 -0.255156 0.378624 -0.042727 -0.215092 -0.273751 0.087196 0.028400 -0.254969 -0.224496 0.269618 -0.134686 -0.207426 0.304581 -0.201363 -0.267136 -0.146759 -0.111565 -0.196691 0.111254 0.094317 0.095575 0.088621 0.095664 0.101283 0.091546 0.102124 0.126629 0.092074 0.100666 0.067623 0.108175 0.095507 0.085807 0.132230 0.118862 0.141844 0.145802 0.161885 0.156502 0.162126 0.146487 0.161966 0.161316 0.161018
qa: -0.3046 -0.4885 -0.3386 0.1325 -0.0237 -0.0669 -0.2585 -0.2951 -0.2552 0.3786 -0.0427 -0.2151 -0.2738 0.0872 0.0284 -0.2550 -0.2245 0.2696 -0.1347 -0.2074 0.3046 -0.2014 -0.2671 -0.1468 -0.1116 -0.1967 0.1113 0.0943 0.0956 0.0886 0.0957 0.1013 0.0915 0.1021 0.1266 0.0921 0.1007 0.0676 0.1082 0.0955 0.0858 0.1322 0.1189 0.1418 0.1458 0.1619 0.1565 0.1621 0.1465 0.1620 0.1613 0.1610
va: 2.1094 1.9903 2.0286 3.7839 3.7711 3.8405 3.8888 3.8912 3.8322 4.0861 3.7250 3.9188 3.9393 3.8086 3.6605 4.0298 3.9695 3.7565 3.8892 3.9337 3.5770 3.8457 3.9996 3.8821 3.8720 3.9025 1.0034 1.0317 1.0025 1.0045 1.0022 0.9991 1.0201 0.9992 1.0047 1.0110 0.9988 1.0046 0.9992 1.0103 1.0065 0.9913 1.0113 1.0153 0.9998 0.9889 0.9970 0.9985 1.0091 0.9898 0.9876 0.9896
dispcorr: -0.027920734 hartree
energy: -1117.881764182701
dipole: -13.91717 13.79819 -0.11899 -14.76167 15.10368 0.34201 3.88872 -3.46753 0.42118
magnitude: 0.55545 au
magnitude: 1.41184 debye
