program: Orca
programVersion: 5.0.2
elementType: O O O C C C C C C C C C C C C C C C C C C C C C C C H H H H H H H H H H H H H H H H H H H H H H H H H H
charge: 0
multiplicity: 1
keywords: wb97x-d3
keywords: def2-TZVPP
keywords: def2/J RIJCOSX
keywords: DEFGRID2
keywords: scfconv7
keywords: smallprint printgap noloewdin
keywords: NOSOSCF
formula: C23H26O3
InChI: InChI=1/C23H26O3/c1-16(2)13-20-21(23(20,3)4)22(24)25-15-17-9-8-12-19(14-17)26-18-10-6-5-7-11-18/h5-14,20-21H,15H2,1-4H3
52 atoms
O  -1.725658 1.126721 -0.44231
O  -3.809825 1.735183 0.047378
O  3.349627 0.88961 0.013578
C  -2.713224 -1.68513 -1.003584
C  -2.527495 -1.648695 0.473064
C  -3.365157 -0.562581 -0.216688
C  -3.693763 -2.698484 -1.549243
C  -1.550526 -1.450854 -1.937136
C  -1.222508 -1.369444 1.118671
C  -2.999429 0.863055 -0.196093
C  -1.100161 -0.877192 2.354178
C  0.239879 -0.677249 2.989034
C  -2.297103 -0.503374 3.183147
C  -1.29208 2.487991 -0.340851
C  0.156215 2.54091 -0.724661
C  1.07037 1.654292 -0.163951
C  0.597043 3.507592 -1.620304
C  2.406778 1.726506 -0.528553
C  1.942495 3.590169 -1.949783
C  2.853793 2.691683 -1.418866
C  3.087703 -0.452236 0.129664
C  2.324936 -1.148116 -0.800233
C  3.667717 -1.111658 1.204987
C  2.129325 -2.511459 -0.630912
C  3.473963 -2.477366 1.353126
C  2.6966 -3.182105 0.444205
H  -3.161952 -2.329431 1.036277
H  -4.433829 -0.67629 -0.077826
H  -4.100475 -2.370207 -2.507479
H  -4.530576 -2.861074 -0.869357
H  -3.201878 -3.659948 -1.708319
H  -0.755782 -0.835332 -1.525729
H  -1.889259 -0.982822 -2.862671
H  -1.107849 -2.412909 -2.202659
H  -0.322996 -1.622055 0.565345
H  0.312916 -1.227422 3.930737
H  0.403214 0.374839 3.235669
H  1.055003 -1.005753 2.344186
H  -2.0083 0.047621 4.078038
H  -2.845415 -1.388863 3.5143
H  -3.005292 0.114908 2.628984
H  -1.433806 2.83676 0.685398
H  -1.880544 3.1297 -0.998577
H  0.742439 0.911212 0.553745
H  -0.111434 4.198279 -2.059706
H  2.281894 4.346236 -2.644626
H  3.900475 2.736944 -1.690262
H  1.882473 -0.643321 -1.649149
H  4.262566 -0.558534 1.920753
H  1.527865 -3.049498 -1.352168
H  3.924998 -2.987996 2.193699
H  2.540264 -4.24519 0.567511
elementType: O C H
totalener: -1117.85072025 hartree
nucrepener: 2393.32350911 hartree
electener: -3511.17422935 hartree
oneelecener: -6275.69860980 hartree
twoeener: 2764.52438045 hartree
cpcmener: -0.02988837 hartree
kineticenergy: 1112.80679226 hartree
xcener: -110.232964277714 hartree
chargesum: -0.0000000
charge: -0.265473 -0.514673 -0.341975 0.145568 -0.040578 -0.133454 -0.270167 -0.273459 -0.188233 0.431207 -0.070277 -0.168873 -0.265596 0.074477 -0.011012 -0.176660 -0.198011 0.269335 -0.126767 -0.236249 0.292502 -0.194693 -0.243498 -0.129626 -0.116069 -0.203718 0.111941 0.092789 0.096602 0.088232 0.094337 0.052913 0.109119 0.101558 0.099247 0.116148 0.101076 0.015548 0.097703 0.106603 0.095048 0.123997 0.107992 0.103256 0.145942 0.160342 0.147978 0.160449 0.144450 0.163359 0.159568 0.159774
qa: -0.2655 -0.5147 -0.3420 0.1456 -0.0406 -0.1335 -0.2702 -0.2735 -0.1882 0.4312 -0.0703 -0.1689 -0.2656 0.0745 -0.0110 -0.1767 -0.1980 0.2693 -0.1268 -0.2362 0.2925 -0.1947 -0.2435 -0.1296 -0.1161 -0.2037 0.1119 0.0928 0.0966 0.0882 0.0943 0.0529 0.1091 0.1016 0.0992 0.1161 0.1011 0.0155 0.0977 0.1066 0.0950 0.1240 0.1080 0.1033 0.1459 0.1603 0.1480 0.1604 0.1444 0.1634 0.1596 0.1598
va: 2.1234 1.9790 2.0744 3.7415 3.7933 3.8735 3.9031 3.9149 3.7011 4.0832 3.7332 3.8758 3.9302 3.8010 3.7605 3.8784 3.9237 3.7047 3.8990 3.9933 3.6589 3.8299 3.9451 3.8222 3.8522 3.8994 1.0048 1.0310 1.0016 1.0054 1.0019 1.0030 1.0051 0.9982 0.9970 0.9981 0.9989 1.0425 1.0054 0.9955 1.0054 0.9934 1.0099 1.0272 1.0007 0.9884 1.0058 0.9918 1.0094 0.9914 0.9880 0.9905
dispcorr: -0.031524948 hartree
energy: -1117.882245195809
dipole: -11.22371 11.81002 0.58631 -13.66057 12.66497 -0.99560 4.70962 -4.89268 -0.18306
magnitude: 1.16982 au
magnitude: 2.97345 debye
