program: Orca
programVersion: 5.0.2
elementType: O O O C C C C C C C C C C C C C C C C C C C C C C C H H H H H H H H H H H H H H H H H H H H H H H H H H
charge: 0
multiplicity: 1
keywords: wb97x-d3
keywords: def2-TZVPP
keywords: def2/J RIJCOSX
keywords: DEFGRID2
keywords: scfconv7
keywords: smallprint printgap noloewdin
keywords: NOSOSCF
formula: C23H26O3
InChI: InChI=1/C23H26O3/c1-16(2)13-20-21(23(20,3)4)22(24)25-15-17-9-8-12-19(14-17)26-18-10-6-5-7-11-18/h5-14,20-21H,15H2,1-4H3
52 atoms
O  -2.426134 1.69433 -1.418206
O  -2.294956 -0.533018 -1.565161
O  2.436056 -0.700979 -0.427606
C  -4.812094 -0.592603 0.263626
C  -3.647665 -0.498106 1.185497
C  -3.780974 0.490051 0.014796
C  -6.137626 -0.08034 0.776924
C  -4.967071 -1.760931 -0.678219
C  -2.571595 -1.515547 1.23895
C  -2.782904 0.453371 -1.062161
C  -1.335728 -1.262685 1.678552
C  -0.298971 -2.338711 1.766476
C  -0.913561 0.111528 2.116527
C  -1.26687 1.851038 -2.251318
C  -0.027806 1.769969 -1.405926
C  0.710144 0.59482 -1.336258
C  0.352144 2.865209 -0.63423
C  1.807056 0.51299 -0.489208
C  1.452674 2.774016 0.203247
C  2.184659 1.597865 0.290998
C  3.775194 -0.7634 -0.129344
C  4.173089 -1.633809 0.873426
C  4.707786 -0.029185 -0.850834
C  5.526236 -1.778011 1.150253
C  6.05531 -0.175242 -0.556826
C  6.470123 -1.049102 0.440663
H  -3.846226 -0.007254 2.135456
H  -4.083284 1.49167 0.29604
H  -6.012765 0.765125 1.454383
H  -6.664885 -0.866537 1.320557
H  -6.778388 0.242211 -0.045737
H  -5.491978 -1.453746 -1.584266
H  -5.569868 -2.534336 -0.198668
H  -4.029625 -2.220103 -0.977313
H  -2.820661 -2.52645 0.930971
H  0.069263 -2.44609 2.790254
H  0.571715 -2.09369 1.153103
H  -0.680894 -3.306286 1.441314
H  0.163549 0.170242 2.271868
H  -1.390443 0.392251 3.059263
H  -1.186814 0.878944 1.389238
H  -1.371763 2.840703 -2.692432
H  -1.258217 1.119191 -3.059114
H  0.435159 -0.263811 -1.935852
H  -0.210446 3.78878 -0.691347
H  1.747415 3.624906 0.803156
H  3.031625 1.537961 0.962208
H  3.431803 -2.196273 1.427381
H  4.389288 0.643611 -1.637333
H  5.83954 -2.459376 1.930201
H  6.784812 0.393271 -1.118478
H  7.523158 -1.161911 0.660995
elementType: O C H
totalener: -1117.85156746 hartree
nucrepener: 2314.83699410 hartree
electener: -3432.68856156 hartree
oneelecener: -6120.27679189 hartree
twoeener: 2687.58823033 hartree
cpcmener: -0.03023684 hartree
kineticenergy: 1112.80770860 hartree
xcener: -110.228578997879 hartree
chargesum: -0.0000000
charge: -0.298255 -0.491099 -0.338943 0.130589 -0.028768 -0.091577 -0.266049 -0.297410 -0.259989 0.395493 -0.013204 -0.209197 -0.308567 0.079216 0.015978 -0.237361 -0.225552 0.288194 -0.115937 -0.223195 0.245484 -0.226419 -0.171021 -0.138122 -0.157715 -0.174512 0.115019 0.092450 0.087967 0.094690 0.095963 0.103663 0.099048 0.090509 0.124933 0.102530 0.077499 0.089691 0.103996 0.123200 0.085879 0.124602 0.114881 0.128244 0.143377 0.162504 0.155460 0.156458 0.160010 0.161636 0.161991 0.161741
qa: -0.2983 -0.4911 -0.3389 0.1306 -0.0288 -0.0916 -0.2660 -0.2974 -0.2600 0.3955 -0.0132 -0.2092 -0.3086 0.0792 0.0160 -0.2374 -0.2256 0.2882 -0.1159 -0.2232 0.2455 -0.2264 -0.1710 -0.1381 -0.1577 -0.1745 0.1150 0.0924 0.0880 0.0947 0.0960 0.1037 0.0990 0.0905 0.1249 0.1025 0.0775 0.0897 0.1040 0.1232 0.0859 0.1246 0.1149 0.1282 0.1434 0.1625 0.1555 0.1565 0.1600 0.1616 0.1620 0.1617
va: 2.1019 1.9912 2.0268 3.7619 3.8112 3.8315 3.8980 3.8911 3.8005 4.1061 3.6514 3.9056 3.9751 3.8098 3.6035 3.9784 3.9541 3.6367 3.8744 3.8993 3.7353 3.9668 3.9218 3.8940 3.8987 3.8880 1.0036 1.0336 1.0044 1.0022 1.0022 0.9995 0.9992 1.0173 0.9999 0.9942 1.0077 1.0110 0.9972 1.0002 0.9975 0.9948 1.0128 1.0343 1.0043 0.9881 1.0000 0.9979 0.9953 0.9896 0.9893 0.9887
dispcorr: -0.028729781 hartree
energy: -1117.880297244754
dipole: -16.50615 16.86253 0.35638 -5.02512 6.32218 1.29706 10.32597 -9.45766 0.86831
magnitude: 1.60104 au
magnitude: 4.06953 debye
