program: Orca
programVersion: 5.0.2
elementType: O O O C C C C C C C C C C C C C C C C C C C C C C C H H H H H H H H H H H H H H H H H H H H H H H H H H
charge: 0
multiplicity: 1
keywords: wb97x-d3
keywords: def2-TZVPP
keywords: def2/J RIJCOSX
keywords: DEFGRID2
keywords: scfconv7
keywords: smallprint printgap noloewdin
keywords: NOSOSCF
formula: C23H26O3
InChI: InChI=1/C23H26O3/c1-16(2)13-20-21(23(20,3)4)22(24)25-15-17-9-8-12-19(14-17)26-18-10-6-5-7-11-18/h5-14,20-21H,15H2,1-4H3
52 atoms
O  -2.18512 2.37517 -0.214418
O  -2.56248 0.809842 -1.758858
O  2.024937 -0.254942 0.351766
C  -4.46695 -0.555772 0.257601
C  -3.196682 -0.693399 1.045578
C  -3.585264 0.653836 0.419483
C  -5.750315 -0.503621 1.054433
C  -4.63501 -1.276412 -1.058778
C  -2.022877 -1.44979 0.570042
C  -2.754644 1.243233 -0.646742
C  -1.276044 -2.258853 1.329373
C  -0.078626 -2.957791 0.763254
C  -1.537197 -2.524608 2.785727
C  -1.268845 3.025344 -1.090087
C  -0.003435 2.242582 -1.313655
C  0.47698 1.351714 -0.361771
C  0.722698 2.455801 -2.480366
C  1.65851 0.662176 -0.595184
C  1.911465 1.774495 -2.692304
C  2.387963 0.866004 -1.759186
C  3.354919 -0.498781 0.586546
C  3.769354 -1.821152 0.637875
C  4.247611 0.538307 0.826792
C  5.093722 -2.107431 0.941072
C  5.569884 0.238009 1.11767
C  5.998796 -1.082031 1.176277
H  -3.326401 -0.691582 2.122031
H  -3.920656 1.387306 1.144131
H  -5.620065 0.015164 2.004981
H  -6.108836 -1.511591 1.271115
H  -6.532754 0.014442 0.496399
H  -5.296289 -0.720219 -1.725076
H  -5.10245 -2.244664 -0.871742
H  -3.706995 -1.464614 -1.589571
H  -1.735658 -1.33055 -0.469211
H  -0.215982 -4.041952 0.78432
H  0.81034 -2.752826 1.364797
H  0.127649 -2.662036 -0.264887
H  -2.597426 -2.538893 3.036553
H  -1.063328 -1.767109 3.41607
H  -1.1176 -3.486239 3.083843
H  -1.043237 3.971422 -0.597664
H  -1.745605 3.260467 -2.043869
H  -0.059745 1.1705 0.561968
H  0.353768 3.147205 -3.227863
H  2.469894 1.93677 -3.604723
H  3.304665 0.322568 -1.947765
H  3.061275 -2.618049 0.447453
H  3.916603 1.568816 0.792755
H  5.417108 -3.139097 0.985385
H  6.266852 1.044041 1.305452
H  7.030882 -1.308826 1.407446
elementType: O C H
totalener: -1117.85208469 hartree
nucrepener: 2300.46731883 hartree
electener: -3418.31940352 hartree
oneelecener: -6091.48604341 hartree
twoeener: 2673.16663989 hartree
cpcmener: -0.03171811 hartree
kineticenergy: 1112.80626639 hartree
xcener: -110.231296355070 hartree
chargesum: 0.0000000
charge: -0.297200 -0.477496 -0.337295 0.129166 0.068014 -0.123260 -0.268715 -0.284678 -0.362125 0.398827 0.011063 -0.251872 -0.291548 0.092412 0.062533 -0.307118 -0.233018 0.296363 -0.128939 -0.218300 0.261769 -0.235845 -0.175200 -0.147560 -0.155157 -0.173211 0.112894 0.101324 0.088803 0.095288 0.094292 0.102614 0.095137 0.092600 0.119092 0.107746 0.096162 0.090938 0.098751 0.108038 0.098599 0.125381 0.118860 0.134152 0.143917 0.161539 0.157249 0.159788 0.160784 0.161107 0.162344 0.160993
qa: -0.2972 -0.4775 -0.3373 0.1292 0.0680 -0.1233 -0.2687 -0.2847 -0.3621 0.3988 0.0111 -0.2519 -0.2915 0.0924 0.0625 -0.3071 -0.2330 0.2964 -0.1289 -0.2183 0.2618 -0.2358 -0.1752 -0.1476 -0.1552 -0.1732 0.1129 0.1013 0.0888 0.0953 0.0943 0.1026 0.0951 0.0926 0.1191 0.1077 0.0962 0.0909 0.0988 0.1080 0.0986 0.1254 0.1189 0.1342 0.1439 0.1615 0.1572 0.1598 0.1608 0.1611 0.1623 0.1610
va: 2.1077 2.0132 2.0355 3.7141 3.7290 3.8645 3.9062 3.8965 3.8840 4.1073 3.6698 3.9295 3.9469 3.7925 3.6108 4.0400 3.9773 3.6860 3.8994 3.9416 3.6998 3.9774 3.9229 3.9103 3.8986 3.8887 1.0018 1.0277 1.0043 1.0020 1.0018 1.0008 1.0011 1.0107 1.0181 0.9976 0.9907 1.0084 1.0007 0.9934 1.0004 0.9926 1.0092 1.0283 1.0022 0.9890 0.9979 0.9989 0.9944 0.9903 0.9891 0.9889
dispcorr: -0.026844178 hartree
energy: -1117.878928866689
dipole: -15.13175 15.59784 0.46609 -13.51438 13.95552 0.44113 7.35825 -6.43761 0.92064
magnitude: 1.12224 au
magnitude: 2.85250 debye
