program: Orca
programVersion: 5.0.2
elementType: O O O C C C C C C C C C C C C C C C C C C C C C C C H H H H H H H H H H H H H H H H H H H H H H H H H H
charge: 0
multiplicity: 1
keywords: wb97x-d3
keywords: def2-TZVPP
keywords: def2/J RIJCOSX
keywords: DEFGRID2
keywords: scfconv7
keywords: smallprint printgap noloewdin
keywords: NOSOSCF
formula: C23H26O3
InChI: InChI=1/C23H26O3/c1-16(2)13-20-21(23(20,3)4)22(24)25-15-17-9-8-12-19(14-17)26-18-10-6-5-7-11-18/h5-14,20-21H,15H2,1-4H3
52 atoms
O  -1.960232 1.793802 -1.103018
O  -1.487912 1.240028 1.007604
O  2.601728 -0.093585 -1.99732
C  -2.194364 -1.619616 -0.158775
C  -3.34218 -1.179996 0.681295
C  -2.793776 -0.232878 -0.374749
C  -2.469283 -2.609695 -1.264803
C  -0.815627 -1.768439 0.437199
C  -3.221902 -0.938055 2.141551
C  -2.027689 0.97633 -0.042102
C  -3.967927 -0.075113 2.834478
C  -3.807637 0.086228 4.314875
C  -4.977151 0.829017 2.195069
C  -1.096856 2.923278 -1.000734
C  0.351084 2.53369 -0.875096
C  0.833924 1.377606 -1.480115
C  1.222098 3.341665 -0.155171
C  2.17095 1.040836 -1.351735
C  2.564255 3.001933 -0.050108
C  3.051194 1.848046 -0.642969
C  3.289228 -1.047778 -1.293419
C  4.184098 -1.828239 -2.014485
C  3.080819 -1.278216 0.061629
C  4.872205 -2.847449 -1.373098
C  3.785227 -2.296014 0.690997
C  4.681215 -3.084266 -0.017839
H  -4.303724 -1.588509 0.378487
H  -3.390667 -0.134316 -1.274054
H  -3.466157 -2.480854 -1.687125
H  -2.397129 -3.632143 -0.889082
H  -1.745126 -2.50276 -2.07458
H  -0.685925 -2.785252 0.810612
H  -0.614209 -1.092609 1.26365
H  -0.051771 -1.60104 -0.324139
H  -2.490483 -1.536963 2.677125
H  -3.538446 1.115224 4.567936
H  -3.039945 -0.571992 4.720028
H  -4.744422 -0.123878 4.836694
H  -5.895366 0.870787 2.784348
H  -5.242195 0.529271 1.18259
H  -4.595381 1.852857 2.146011
H  -1.394379 3.56809 -0.172413
H  -1.262112 3.478572 -1.923027
H  0.180817 0.724992 -2.047325
H  0.850701 4.23431 0.33266
H  3.238094 3.637854 0.508519
H  4.097097 1.582574 -0.553844
H  4.335221 -1.638459 -3.069942
H  2.375524 -0.682331 0.627431
H  5.568768 -3.453141 -1.938174
H  3.622128 -2.474129 1.746002
H  5.225611 -3.87498 0.480849
elementType: O C H
totalener: -1117.85212649 hartree
nucrepener: 2305.46533242 hartree
electener: -3423.31745890 hartree
oneelecener: -6101.39063954 hartree
twoeener: 2678.07318064 hartree
cpcmener: -0.03215913 hartree
kineticenergy: 1112.80258964 hartree
xcener: -110.229949881557 hartree
chargesum: 0.0000000
charge: -0.302076 -0.483488 -0.344058 0.155126 -0.018645 -0.097646 -0.265717 -0.311942 -0.279076 0.387699 -0.028118 -0.225525 -0.268968 0.100413 0.039294 -0.287204 -0.214972 0.261530 -0.131212 -0.183759 0.319214 -0.254611 -0.209573 -0.129226 -0.168412 -0.187147 0.115525 0.096000 0.089387 0.094786 0.096087 0.109463 0.099921 0.088824 0.126918 0.094709 0.089507 0.095960 0.104139 0.095853 0.100729 0.117639 0.122989 0.136517 0.145436 0.161542 0.160450 0.147683 0.154876 0.160443 0.161612 0.161102
qa: -0.3021 -0.4835 -0.3441 0.1551 -0.0186 -0.0976 -0.2657 -0.3119 -0.2791 0.3877 -0.0281 -0.2255 -0.2690 0.1004 0.0393 -0.2872 -0.2150 0.2615 -0.1312 -0.1838 0.3192 -0.2546 -0.2096 -0.1292 -0.1684 -0.1871 0.1155 0.0960 0.0894 0.0948 0.0961 0.1095 0.0999 0.0888 0.1269 0.0947 0.0895 0.0960 0.1041 0.0959 0.1007 0.1176 0.1230 0.1365 0.1454 0.1615 0.1605 0.1477 0.1549 0.1604 0.1616 0.1611
va: 2.1038 1.9917 2.0404 3.7362 3.8553 3.8332 3.8981 3.9004 3.8420 4.0830 3.7054 3.9270 3.9454 3.7976 3.6074 4.0217 3.9695 3.7251 3.8873 3.9347 3.6239 4.0015 3.8654 3.8901 3.9172 3.8962 1.0030 1.0313 1.0045 1.0019 1.0024 1.0015 1.0105 1.0034 0.9984 0.9953 1.0069 0.9971 1.0010 1.0033 0.9980 1.0084 0.9933 1.0255 1.0016 0.9889 0.9943 1.0081 0.9979 0.9881 0.9902 0.9891
dispcorr: -0.026943645 hartree
energy: -1117.879070131577
dipole: -18.69764 18.31230 -0.38534 -8.29760 8.26283 -0.03477 12.62420 -12.88475 -0.26055
magnitude: 0.46646 au
magnitude: 1.18565 debye
