program: Orca
programVersion: 5.0.2
elementType: O O O C C C C C C C C C C C C C C C C C C C C C C C H H H H H H H H H H H H H H H H H H H H H H H H H H
charge: 0
multiplicity: 1
keywords: wb97x-d3
keywords: def2-TZVPP
keywords: def2/J RIJCOSX
keywords: DEFGRID2
keywords: scfconv7
keywords: smallprint printgap noloewdin
keywords: NOSOSCF
formula: C23H26O3
InChI: InChI=1/C23H26O3/c1-16(2)13-20-21(23(20,3)4)22(24)25-15-17-9-8-12-19(14-17)26-18-10-6-5-7-11-18/h5-14,20-21H,15H2,1-4H3
52 atoms
O  -2.325302 1.767321 -1.447569
O  -2.277954 -0.45956 -1.653514
O  2.465556 -0.771409 -0.394107
C  -4.853212 -0.460791 0.109002
C  -3.711889 -0.419865 1.063647
C  -3.777391 0.585309 -0.099024
C  -6.171989 0.097609 0.591644
C  -5.028173 -1.617685 -0.843042
C  -2.680942 -1.483316 1.129843
C  -2.743477 0.532899 -1.141048
C  -1.448636 -1.300262 1.61211
C  -0.468626 -2.427986 1.707437
C  -0.965926 0.036601 2.09727
C  -1.137877 1.904225 -2.243267
C  0.072901 1.772489 -1.36419
C  0.782483 0.57984 -1.305492
C  0.45784 2.840862 -0.557704
C  1.860644 0.455636 -0.438902
C  1.539038 2.707341 0.298584
C  2.246977 1.515132 0.370756
C  3.796247 -0.856674 -0.058024
C  4.762716 -0.192449 -0.802108
C  4.148834 -1.672277 1.005413
C  6.099991 -0.358747 -0.473576
C  5.491914 -1.835996 1.319011
C  6.469709 -1.180333 0.584331
H  -3.916384 0.066857 2.013958
H  -4.053467 1.592915 0.187832
H  -6.03301 0.93059 1.281692
H  -6.745247 -0.672433 1.111125
H  -6.7758 0.453929 -0.24497
H  -5.545039 -1.292731 -1.747386
H  -5.647638 -2.382523 -0.371086
H  -4.099567 -2.093028 -1.144469
H  -2.965739 -2.476141 0.795056
H  0.413559 -2.229591 1.092954
H  -0.899029 -3.376415 1.387074
H  -0.107046 -2.548022 2.731954
H  -1.313887 0.234121 3.114968
H  -1.319208 0.861011 1.475696
H  0.123335 0.079976 2.1232
H  -1.200679 2.904021 -2.669355
H  -1.125697 1.186931 -3.063944
H  0.502034 -0.258217 -1.931276
H  -0.084584 3.776967 -0.60434
H  1.838194 3.537688 0.924495
H  3.080735 1.422659 1.054738
H  4.47708 0.439686 -1.633765
H  3.380832 -2.178251 1.576955
H  6.856978 0.15188 -1.054151
H  5.77074 -2.474896 2.146528
H  7.514811 -1.310145 0.831653
elementType: O C H
totalener: -1117.85182606 hartree
nucrepener: 2309.24402181 hartree
electener: -3427.09584787 hartree
oneelecener: -6109.11357635 hartree
twoeener: 2682.01772848 hartree
cpcmener: -0.03053429 hartree
kineticenergy: 1112.80321716 hartree
xcener: -110.226973981513 hartree
chargesum: -0.0000000
charge: -0.297182 -0.492441 -0.340140 0.133281 -0.023545 -0.096434 -0.265321 -0.298606 -0.269039 0.395934 -0.002200 -0.211503 -0.320821 0.082008 0.020790 -0.234184 -0.233037 0.273694 -0.117918 -0.212981 0.227918 -0.159467 -0.215130 -0.161644 -0.143522 -0.167769 0.115618 0.093263 0.088254 0.094642 0.096322 0.102961 0.099962 0.090597 0.125115 0.077915 0.090517 0.102017 0.125635 0.092462 0.103408 0.124619 0.114580 0.128275 0.143973 0.162245 0.154988 0.160410 0.155326 0.162172 0.162094 0.161888
qa: -0.2972 -0.4924 -0.3401 0.1333 -0.0235 -0.0964 -0.2653 -0.2986 -0.2690 0.3959 -0.0022 -0.2115 -0.3208 0.0820 0.0208 -0.2342 -0.2330 0.2737 -0.1179 -0.2130 0.2279 -0.1595 -0.2151 -0.1616 -0.1435 -0.1678 0.1156 0.0933 0.0883 0.0946 0.0963 0.1030 0.1000 0.0906 0.1251 0.0779 0.0905 0.1020 0.1256 0.0925 0.1034 0.1246 0.1146 0.1283 0.1440 0.1622 0.1550 0.1604 0.1553 0.1622 0.1621 0.1619
va: 2.1028 1.9905 2.0215 3.7579 3.8026 3.8370 3.8965 3.8916 3.8162 4.1113 3.6502 3.9113 3.9697 3.8064 3.6073 3.9775 3.9583 3.6462 3.8769 3.8933 3.7449 3.9232 3.9649 3.9010 3.8928 3.8820 1.0029 1.0335 1.0042 1.0023 1.0022 0.9998 0.9986 1.0172 0.9999 1.0069 1.0106 0.9941 0.9988 0.9984 0.9953 0.9948 1.0130 1.0336 1.0042 0.9882 1.0003 0.9951 0.9985 0.9892 0.9894 0.9887
dispcorr: -0.028470241 hartree
energy: -1117.880296302940
dipole: -17.13001 17.52734 0.39732 -4.84479 6.11282 1.26803 9.84650 -8.92576 0.92074
magnitude: 1.61664 au
magnitude: 4.10918 debye
