program: Orca
programVersion: 5.0.2
elementType: O O O C C C C C C C C C C C C C C C C C C C C C C C H H H H H H H H H H H H H H H H H H H H H H H H H H
charge: 0
multiplicity: 1
keywords: wb97x-d3
keywords: def2-TZVPP
keywords: def2/J RIJCOSX
keywords: DEFGRID2
keywords: scfconv7
keywords: smallprint printgap noloewdin
keywords: NOSOSCF
formula: C23H26O3
InChI: InChI=1/C23H26O3/c1-16(2)13-20-21(23(20,3)4)22(24)25-15-17-9-8-12-19(14-17)26-18-10-6-5-7-11-18/h5-14,20-21H,15H2,1-4H3
52 atoms
O  -1.941094 1.776587 -1.033102
O  -1.459023 1.293401 1.092477
O  2.569838 -0.143698 -2.141276
C  -2.204123 -1.599332 0.075505
C  -3.350817 -1.099612 0.880362
C  -2.782389 -0.219119 -0.225932
C  -2.487773 -2.648575 -0.97261
C  -0.830208 -1.734636 0.684625
C  -3.243336 -0.755708 2.318991
C  -2.006057 0.995874 0.05524
C  -4.053835 0.104677 2.939238
C  -3.910061 0.406276 4.398345
C  -5.120085 0.86793 2.208354
C  -1.058927 2.89569 -0.97366
C  0.384563 2.480042 -0.886423
C  0.834116 1.332723 -1.533575
C  1.284451 3.253396 -0.164343
C  2.16956 0.975917 -1.451605
C  2.623933 2.892292 -0.103496
C  3.078983 1.751029 -0.743721
C  3.284596 -1.112732 -1.485201
C  3.105246 -1.389363 -0.13465
C  4.174872 -1.857191 -2.248238
C  3.835056 -2.416372 0.448386
C  4.88876 -2.886852 -1.652917
C  4.72806 -3.168638 -0.302446
H  -4.316784 -1.509656 0.593066
H  -3.370796 -0.161912 -1.134299
H  -3.480503 -2.531226 -1.408002
H  -2.432342 -3.647732 -0.535961
H  -1.757687 -2.599914 -1.782695
H  -0.720709 -2.729546 1.120633
H  -0.615863 -1.013013 1.468412
H  -0.061732 -1.630134 -0.084665
H  -2.468318 -1.252407 2.895168
H  -4.826609 0.164396 4.942456
H  -3.729876 1.472785 4.558685
H  -3.089036 -0.14714 4.853612
H  -5.915632 1.188717 2.884035
H  -5.577257 0.287903 1.40465
H  -4.704523 1.774165 1.753674
H  -1.320483 3.557345 -0.145974
H  -1.243017 3.440431 -1.899426
H  0.15605 0.705675 -2.100251
H  0.938582 4.137368 0.356844
H  3.321089 3.501232 0.456593
H  4.1233 1.47024 -0.690713
H  2.403359 -0.821445 0.463244
H  4.30327 -1.632217 -3.299774
H  3.695535 -2.629535 1.500278
H  5.581919 -3.464786 -2.2503
H  5.292833 -3.966972 0.160062
elementType: O C H
totalener: -1117.85179807 hartree
nucrepener: 2297.15673690 hartree
electener: -3415.00853497 hartree
oneelecener: -6084.71776716 hartree
twoeener: 2669.70923219 hartree
cpcmener: -0.03207606 hartree
kineticenergy: 1112.78999528 hartree
xcener: -110.226706495567 hartree
chargesum: 0.0000000
charge: -0.303226 -0.484395 -0.344004 0.141559 -0.026509 -0.066894 -0.265185 -0.308951 -0.270005 0.367555 -0.027295 -0.224245 -0.274314 0.103775 0.040739 -0.291491 -0.216420 0.263466 -0.131481 -0.183097 0.314500 -0.208290 -0.250949 -0.169816 -0.129149 -0.186888 0.116578 0.094015 0.089167 0.094961 0.096187 0.109332 0.098205 0.091859 0.128530 0.094863 0.098437 0.087346 0.102003 0.098226 0.101260 0.116980 0.122733 0.133986 0.146117 0.161889 0.160744 0.156109 0.147983 0.161873 0.160324 0.161303
qa: -0.3032 -0.4844 -0.3440 0.1416 -0.0265 -0.0669 -0.2652 -0.3090 -0.2700 0.3676 -0.0273 -0.2242 -0.2743 0.1038 0.0407 -0.2915 -0.2164 0.2635 -0.1315 -0.1831 0.3145 -0.2083 -0.2509 -0.1698 -0.1291 -0.1869 0.1166 0.0940 0.0892 0.0950 0.0962 0.1093 0.0982 0.0919 0.1285 0.0949 0.0984 0.0873 0.1020 0.0982 0.1013 0.1170 0.1227 0.1340 0.1461 0.1619 0.1607 0.1561 0.1480 0.1619 0.1603 0.1613
va: 2.1033 1.9905 2.0446 3.7643 3.8470 3.8289 3.8972 3.9019 3.8161 4.0937 3.7071 3.9272 3.9499 3.7957 3.6065 4.0246 3.9697 3.7228 3.8886 3.9312 3.6352 3.8650 3.9988 3.9200 3.8895 3.8963 1.0013 1.0320 1.0046 1.0019 1.0025 1.0008 1.0126 0.9998 0.9975 0.9960 0.9939 1.0075 1.0031 0.9995 0.9970 1.0094 0.9931 1.0279 1.0016 0.9890 0.9942 0.9962 1.0079 0.9903 0.9882 0.9890
dispcorr: -0.026626146 hartree
energy: -1117.878424217316
dipole: -19.08459 18.72820 -0.35639 -7.74100 7.64482 -0.09617 13.56450 -13.81610 -0.25160
magnitude: 0.44673 au
magnitude: 1.13549 debye
