program: Orca
programVersion: 5.0.2
elementType: O O O C C C C C C C C C C C C C C C C C C C C C C C H H H H H H H H H H H H H H H H H H H H H H H H H H
charge: 0
multiplicity: 1
keywords: wb97x-d3
keywords: def2-TZVPP
keywords: def2/J RIJCOSX
keywords: DEFGRID2
keywords: scfconv7
keywords: smallprint printgap noloewdin
keywords: NOSOSCF
formula: C23H26O3
InChI: InChI=1/C23H26O3/c1-16(2)13-20-21(23(20,3)4)22(24)25-15-17-9-8-12-19(14-17)26-18-10-6-5-7-11-18/h5-14,20-21H,15H2,1-4H3
52 atoms
O  -1.766921 1.24791 0.094006
O  -3.183646 2.024004 1.625824
O  3.003509 0.016043 -1.575778
C  -3.839013 -0.779383 -0.747686
C  -3.139331 -1.41554 0.402347
C  -3.719592 -0.002312 0.550952
C  -5.241771 -1.259787 -1.043891
C  -3.092746 -0.386257 -1.999718
C  -1.681321 -1.679533 0.426659
C  -2.879281 1.177524 0.809247
C  -0.992721 -1.895917 1.550373
C  0.466137 -2.225521 1.522289
C  -1.636373 -1.833112 2.906246
C  -0.892232 2.361175 0.320506
C  0.234997 2.255962 -0.66189
C  1.087511 1.154547 -0.631647
C  0.439344 3.263442 -1.596101
C  2.147306 1.084831 -1.524489
C  1.496803 3.176189 -2.49174
C  2.358343 2.09323 -2.457515
C  3.380577 -0.634689 -0.427329
C  3.666781 0.043174 0.751538
C  3.527728 -2.012141 -0.506682
C  4.081786 -0.678116 1.861756
C  3.956156 -2.718632 0.608299
C  4.226026 -2.058022 1.798652
H  -3.729748 -2.140978 0.956501
H  -4.631708 0.048051 1.133922
H  -5.820529 -0.485607 -1.551122
H  -5.778149 -1.535803 -0.135454
H  -5.216335 -2.135914 -1.694381
H  -2.038747 -0.172931 -1.850255
H  -3.549248 0.492121 -2.45915
H  -3.157286 -1.20113 -2.723113
H  -1.161125 -1.737273 -0.524596
H  0.850364 -2.291944 0.505317
H  0.66405 -3.178559 2.020377
H  1.047673 -1.47199 2.060044
H  -2.156109 -2.766777 3.142242
H  -2.372367 -1.029968 2.978541
H  -0.894021 -1.677388 3.690382
H  -0.518716 2.32881 1.346477
H  -1.429121 3.300943 0.183464
H  0.924087 0.364374 0.092544
H  -0.226604 4.116493 -1.624176
H  1.656341 3.961422 -3.218572
H  3.188389 2.024315 -3.149037
H  3.569923 1.119635 0.812015
H  3.305636 -2.526118 -1.433348
H  4.300229 -0.150851 2.781087
H  4.068095 -3.792973 0.544242
H  4.550343 -2.612048 2.669337
elementType: O C H
totalener: -1117.85058780 hartree
nucrepener: 2341.40406950 hartree
electener: -3459.25465730 hartree
oneelecener: -6172.08309187 hartree
twoeener: 2712.82843457 hartree
cpcmener: -0.03036637 hartree
kineticenergy: 1112.80282230 hartree
xcener: -110.230011579803 hartree
chargesum: 0.0000000
charge: -0.265916 -0.514837 -0.340174 0.143398 -0.036169 -0.124505 -0.270236 -0.280624 -0.273954 0.429744 -0.009212 -0.255226 -0.283128 0.069069 -0.036107 -0.203215 -0.183741 0.285844 -0.122532 -0.250221 0.319125 -0.209305 -0.287912 -0.136173 -0.100243 -0.197668 0.114270 0.094091 0.096349 0.088635 0.094278 0.078009 0.104456 0.098307 0.129729 0.100760 0.121038 0.097117 0.109160 0.096435 0.096504 0.124985 0.106333 0.145290 0.145971 0.160555 0.148235 0.155911 0.146754 0.161224 0.159418 0.160103
qa: -0.2659 -0.5148 -0.3402 0.1434 -0.0362 -0.1245 -0.2702 -0.2806 -0.2740 0.4297 -0.0092 -0.2552 -0.2831 0.0691 -0.0361 -0.2032 -0.1837 0.2858 -0.1225 -0.2502 0.3191 -0.2093 -0.2879 -0.1362 -0.1002 -0.1977 0.1143 0.0941 0.0963 0.0886 0.0943 0.0780 0.1045 0.0983 0.1297 0.1008 0.1210 0.0971 0.1092 0.0964 0.0965 0.1250 0.1063 0.1453 0.1460 0.1606 0.1482 0.1559 0.1468 0.1612 0.1594 0.1601
va: 2.1180 1.9815 2.0665 3.7506 3.8038 3.8760 3.9023 3.9064 3.7999 4.0830 3.7075 3.9214 3.9471 3.8111 3.7772 3.9030 3.9067 3.6973 3.9010 3.9946 3.6130 3.9059 3.9679 3.8459 3.8187 3.8807 1.0027 1.0298 1.0017 1.0049 1.0020 1.0085 1.0006 1.0003 0.9975 0.9964 0.9934 0.9897 0.9957 1.0013 1.0036 0.9949 1.0093 0.9811 1.0004 0.9883 1.0064 0.9974 1.0092 0.9898 0.9890 0.9905
dispcorr: -0.029159306 hartree
energy: -1117.879747107927
dipole: -13.80099 14.29783 0.49683 -12.54747 11.75693 -0.79054 4.27879 -4.53184 -0.25305
magnitude: 0.96739 au
magnitude: 2.45890 debye
