program: Orca
programVersion: 5.0.2
elementType: O O O C C C C C C C C C C C C C C C C C C C C C C C H H H H H H H H H H H H H H H H H H H H H H H H H H
charge: 0
multiplicity: 1
keywords: wb97x-d3
keywords: def2-TZVPP
keywords: def2/J RIJCOSX
keywords: DEFGRID2
keywords: scfconv7
keywords: smallprint printgap noloewdin
keywords: NOSOSCF
formula: C23H26O3
InChI: InChI=1/C23H26O3/c1-16(2)13-20-21(23(20,3)4)22(24)25-15-17-9-8-12-19(14-17)26-18-10-6-5-7-11-18/h5-14,20-21H,15H2,1-4H3
52 atoms
O  -1.964775 1.852689 -1.398878
O  -1.592704 1.678107 0.794466
O  2.568852 -0.220442 -1.976497
C  -2.178971 -1.355578 -0.017315
C  -3.360604 -0.87365 0.768638
C  -2.828299 -0.025673 -0.377724
C  -2.415101 -2.472771 -1.003975
C  -0.804643 -1.400715 0.602655
C  -3.286721 -0.493456 2.192573
C  -2.082253 1.232288 -0.21733
C  -4.200938 -0.787733 3.124906
C  -3.998842 -0.361073 4.548512
C  -5.476552 -1.537674 2.887467
C  -1.079044 2.969413 -1.464617
C  0.357041 2.572722 -1.254276
C  0.826575 1.3380 -1.69262
C  1.230583 3.452084 -0.626955
C  2.154172 0.996646 -1.494143
C  2.563612 3.105244 -0.452312
C  3.038108 1.875889 -0.88131
C  3.325484 -1.036737 -1.173795
C  4.302763 -1.801184 -1.795508
C  3.102675 -1.144934 0.193938
C  5.06391 -2.681333 -1.03944
C  3.878378 -2.022899 0.937943
C  4.861172 -2.792177 0.329353
H  -4.289195 -1.356223 0.48628
H  -3.426359 -0.053899 -1.281244
H  -1.693396 -2.429295 -1.821946
H  -3.415114 -2.42829 -1.436156
H  -2.305774 -3.443235 -0.515851
H  -0.03728 -1.36563 -0.173573
H  -0.678457 -2.342785 1.139689
H  -0.601139 -0.59778 1.306416
H  -2.409022 0.048151 2.521157
H  -3.95303 -1.226537 5.214874
H  -4.835931 0.249747 4.896774
H  -3.083283 0.214805 4.681351
H  -6.339055 -0.886053 3.048385
H  -5.574363 -2.356126 3.604397
H  -5.565702 -1.963227 1.890786
H  -1.373214 3.745593 -0.755305
H  -1.220139 3.371793 -2.468057
H  0.169888 0.6280 -2.181069
H  0.869274 4.407952 -0.268738
H  3.241154 3.79651 0.031165
H  4.077557 1.609764 -0.737323
H  4.464542 -1.707947 -2.861876
H  2.333874 -0.55825 0.681043
H  5.82534 -3.276722 -1.525886
H  3.705567 -2.106745 2.002891
H  5.460584 -3.475026 0.916264
elementType: O C H
totalener: -1117.85291088 hartree
nucrepener: 2276.01409576 hartree
electener: -3393.86700664 hartree
oneelecener: -6042.17757563 hartree
twoeener: 2648.31056899 hartree
cpcmener: -0.03095159 hartree
kineticenergy: 1112.79581679 hartree
xcener: -110.229331451085 hartree
chargesum: 0.0000000
charge: -0.297683 -0.481810 -0.345379 0.124702 0.023122 -0.071395 -0.263502 -0.296092 -0.299892 0.376535 -0.052728 -0.220730 -0.258132 0.100216 0.046305 -0.304055 -0.218545 0.268725 -0.131969 -0.184269 0.302527 -0.249333 -0.192358 -0.131082 -0.173156 -0.182271 0.121178 0.099501 0.094209 0.089126 0.095861 0.087268 0.110230 0.099827 0.118887 0.094149 0.092525 0.088580 0.099864 0.093801 0.090108 0.117531 0.123447 0.139276 0.144386 0.162525 0.159256 0.147422 0.159359 0.161208 0.161757 0.160967
qa: -0.2977 -0.4818 -0.3454 0.1247 0.0231 -0.0714 -0.2635 -0.2961 -0.2999 0.3765 -0.0527 -0.2207 -0.2581 0.1002 0.0463 -0.3041 -0.2185 0.2687 -0.1320 -0.1843 0.3025 -0.2493 -0.1924 -0.1311 -0.1732 -0.1823 0.1212 0.0995 0.0942 0.0891 0.0959 0.0873 0.1102 0.0998 0.1189 0.0941 0.0925 0.0886 0.0999 0.0938 0.0901 0.1175 0.1234 0.1393 0.1444 0.1625 0.1593 0.1474 0.1594 0.1612 0.1618 0.1610
va: 2.1048 2.0020 2.0371 3.7064 3.7564 3.8263 3.9048 3.9012 3.8451 4.1347 3.7814 3.9218 3.9383 3.7938 3.6045 4.0122 3.9727 3.7213 3.8883 3.9232 3.6367 4.0089 3.8674 3.8879 3.9220 3.8939 1.0014 1.0296 1.0030 1.0053 1.0012 1.0024 1.0030 1.0105 1.0249 0.9965 0.9958 1.0089 0.9959 0.9974 1.0132 1.0095 0.9932 1.0244 1.0020 0.9888 0.9949 1.0080 0.9937 0.9879 0.9905 0.9891
dispcorr: -0.025935969 hartree
energy: -1117.878846849675
dipole: -19.34222 19.12490 -0.21733 -12.64384 12.19336 -0.45048 15.31534 -15.57299 -0.25766
magnitude: 0.56263 au
magnitude: 1.43009 debye
