program: Orca
programVersion: 5.0.2
elementType: O O O C C C C C C C C C C C C C C C C C C C C C C C H H H H H H H H H H H H H H H H H H H H H H H H H H
charge: 0
multiplicity: 1
keywords: wb97x-d3
keywords: def2-TZVPP
keywords: def2/J RIJCOSX
keywords: DEFGRID2
keywords: scfconv7
keywords: smallprint printgap noloewdin
keywords: NOSOSCF
formula: C23H26O3
InChI: InChI=1/C23H26O3/c1-16(2)13-20-21(23(20,3)4)22(24)25-15-17-9-8-12-19(14-17)26-18-10-6-5-7-11-18/h5-14,20-21H,15H2,1-4H3
52 atoms
O  -1.084744 0.897284 -1.403458
O  -1.67342 1.278548 0.715749
O  3.947507 0.503693 -0.202814
C  -1.875156 -1.838978 0.869115
C  -3.246283 -1.337299 0.588627
C  -2.080729 -0.865086 -0.283418
C  -1.554418 -3.253068 0.447914
C  -1.132893 -1.41932 2.113066
C  -3.982139 -0.425703 1.496296
C  -1.613203 0.52588 -0.229719
C  -4.956007 0.388485 1.082297
C  -5.716344 1.258486 2.032682
C  -5.338357 0.482489 -0.368441
C  -0.494997 2.199101 -1.467602
C  0.763281 2.28404 -0.649169
C  1.759476 1.328082 -0.82609
C  0.941176 3.306373 0.273605
C  2.917234 1.394704 -0.064484
C  2.118391 3.380671 1.005817
C  3.106805 2.422918 0.851133
C  3.698556 -0.783416 -0.615852
C  4.513666 -1.299142 -1.611662
C  2.715569 -1.566205 -0.022305
C  4.344567 -2.616053 -2.01802
C  2.54979 -2.876264 -0.447401
C  3.358232 -3.405755 -1.445255
H  -3.884006 -2.029783 0.04328
H  -2.027936 -1.308777 -1.270322
H  -2.081582 -3.536769 -0.463686
H  -1.841327 -3.957432 1.231213
H  -0.484724 -3.375489 0.268006
H  -0.05584 -1.421211 1.931977
H  -1.330802 -2.135452 2.912984
H  -1.405571 -0.435553 2.484923
H  -3.730271 -0.453439 2.551954
H  -6.786877 1.041475 1.992744
H  -5.607666 2.313191 1.766822
H  -5.383449 1.133085 3.062861
H  -4.480139 0.726811 -0.998717
H  -6.096173 1.247249 -0.536264
H  -5.741688 -0.461748 -0.742039
H  -1.209989 2.966288 -1.164709
H  -0.277664 2.34783 -2.525141
H  1.626572 0.539347 -1.556755
H  0.162338 4.043832 0.420392
H  2.259303 4.178054 1.723441
H  4.017934 2.468121 1.433956
H  5.277015 -0.676841 -2.060586
H  2.084727 -1.166775 0.7625
H  4.982117 -3.019016 -2.793655
H  1.784911 -3.488461 0.012133
H  3.223386 -4.429158 -1.768586
elementType: O C H
totalener: -1117.85157121 hartree
nucrepener: 2312.66423513 hartree
electener: -3430.51580634 hartree
oneelecener: -6115.46839886 hartree
twoeener: 2684.95259251 hartree
cpcmener: -0.03303338 hartree
kineticenergy: 1112.80530629 hartree
xcener: -110.228968441947 hartree
chargesum: -0.0000000
charge: -0.306291 -0.490468 -0.341109 0.120292 -0.034081 -0.070823 -0.261923 -0.290950 -0.271977 0.386969 -0.015951 -0.225363 -0.272946 0.103473 0.025235 -0.247389 -0.229464 0.293632 -0.113920 -0.262321 0.289871 -0.239542 -0.222051 -0.127424 -0.156853 -0.190725 0.118462 0.095080 0.090220 0.096035 0.087565 0.093842 0.104161 0.093273 0.127084 0.099179 0.097592 0.086043 0.096565 0.097928 0.102355 0.114585 0.125294 0.138491 0.145394 0.160810 0.148570 0.148944 0.179630 0.161636 0.182226 0.161135
qa: -0.3063 -0.4905 -0.3411 0.1203 -0.0341 -0.0708 -0.2619 -0.2910 -0.2720 0.3870 -0.0160 -0.2254 -0.2729 0.1035 0.0252 -0.2474 -0.2295 0.2936 -0.1139 -0.2623 0.2899 -0.2395 -0.2221 -0.1274 -0.1569 -0.1907 0.1185 0.0951 0.0902 0.0960 0.0876 0.0938 0.1042 0.0933 0.1271 0.0992 0.0976 0.0860 0.0966 0.0979 0.1024 0.1146 0.1253 0.1385 0.1454 0.1608 0.1486 0.1489 0.1796 0.1616 0.1822 0.1611
va: 2.0955 1.9904 2.0673 3.7653 3.8363 3.8053 3.8985 3.8930 3.8014 4.0691 3.6868 3.9210 3.9510 3.8024 3.6285 3.9245 3.9515 3.6957 3.8943 4.0047 3.6971 4.0034 3.9262 3.8819 3.8807 3.9242 1.0016 1.0308 1.0057 1.0030 1.0111 1.0059 0.9993 1.0166 0.9986 0.9933 0.9937 1.0083 0.9997 1.0055 0.9969 1.0084 0.9929 1.0175 1.0039 0.9878 1.0064 1.0067 0.9778 0.9878 0.9772 0.9908
dispcorr: -0.026898907 hartree
energy: -1117.878470120973
dipole: -25.41552 24.84335 -0.57216 -8.39181 7.50250 -0.88931 6.21582 -7.14657 -0.93075
magnitude: 1.40873 au
magnitude: 3.58072 debye
