program: Orca
programVersion: 5.0.2
elementType: O O O C C C C C C C C C C C C C C C C C C C C C C C H H H H H H H H H H H H H H H H H H H H H H H H H H
charge: 0
multiplicity: 1
keywords: wb97x-d3
keywords: def2-TZVPP
keywords: def2/J RIJCOSX
keywords: DEFGRID2
keywords: scfconv7
keywords: smallprint printgap noloewdin
keywords: NOSOSCF
formula: C23H26O3
InChI: InChI=1/C23H26O3/c1-16(2)13-20-21(23(20,3)4)22(24)25-15-17-9-8-12-19(14-17)26-18-10-6-5-7-11-18/h5-14,20-21H,15H2,1-4H3
52 atoms
O  -2.056788 2.358844 0.208222
O  -2.617923 1.052567 -1.51227
O  2.990871 1.39495 0.661814
C  -4.133217 -0.718647 0.532226
C  -2.708686 -1.104677 0.785889
C  -3.116246 0.378498 0.742401
C  -5.092435 -0.903773 1.68558
C  -4.788455 -0.970449 -0.803773
C  -1.832098 -1.697415 -0.23993
C  -2.599477 1.256607 -0.319471
C  -0.900541 -2.636445 -0.033337
C  -0.073133 -3.143413 -1.17701
C  -0.577299 -3.261408 1.289517
C  -1.311029 3.214559 -0.668801
C  -0.003375 2.574905 -1.040228
C  0.903107 2.249653 -0.033735
C  0.29919 2.263074 -2.358802
C  2.096263 1.62893 -0.35525
C  1.500459 1.637312 -2.669187
C  2.405023 1.310514 -1.67237
C  3.469808 0.125338 0.857369
C  2.720111 -1.01117 0.578999
C  4.741082 0.018415 1.407158
C  3.260772 -2.260153 0.855769
C  5.262809 -1.236153 1.684732
C  4.528428 -2.381553 1.407471
H  -2.506803 -1.428558 1.800187
H  -3.141783 0.854488 1.715613
H  -5.939866 -0.220918 1.599577
H  -4.613501 -0.721219 2.648272
H  -5.485206 -1.922064 1.696932
H  -4.107999 -0.968484 -1.649242
H  -5.562911 -0.226297 -0.997215
H  -5.274687 -1.94737 -0.781117
H  -1.950516 -1.343388 -1.257113
H  -0.300987 -2.628428 -2.110012
H  -0.23277 -4.213576 -1.332974
H  0.993979 -3.019582 -0.976233
H  -1.274609 -3.005742 2.084075
H  0.422082 -2.96574 1.619805
H  -0.561058 -4.35006 1.202302
H  -1.150922 4.123902 -0.09129
H  -1.892853 3.476243 -1.553527
H  0.686711 2.485714 1.001666
H  -0.402293 2.508024 -3.146053
H  1.732816 1.396638 -3.698075
H  3.340522 0.823598 -1.918205
H  1.723024 -0.935659 0.161955
H  5.3136 0.912514 1.619099
H  2.676733 -3.145709 0.640138
H  6.252692 -1.315223 2.114595
H  4.939222 -3.359378 1.619829
elementType: O C H
totalener: -1117.85302098 hartree
nucrepener: 2320.84284751 hartree
electener: -3438.69586849 hartree
oneelecener: -6131.68349167 hartree
twoeener: 2692.98762318 hartree
cpcmener: -0.03004601 hartree
kineticenergy: 1112.80159921 hartree
xcener: -110.228891789920 hartree
chargesum: 0.0000000
charge: -0.296775 -0.491359 -0.343698 0.108423 0.045935 -0.093649 -0.263659 -0.284686 -0.295178 0.403407 -0.066420 -0.224195 -0.262863 0.098404 0.003106 -0.257406 -0.182787 0.241580 -0.145959 -0.174431 0.261208 -0.141911 -0.241945 -0.153669 -0.130245 -0.208630 0.116983 0.098060 0.094335 0.088296 0.095487 0.093546 0.102939 0.095685 0.121100 0.091399 0.103996 0.087700 0.094806 0.094382 0.099968 0.126843 0.114264 0.132445 0.146293 0.161777 0.161089 0.150850 0.147243 0.156402 0.160571 0.160943
qa: -0.2968 -0.4914 -0.3437 0.1084 0.0459 -0.0936 -0.2637 -0.2847 -0.2952 0.4034 -0.0664 -0.2242 -0.2629 0.0984 0.0031 -0.2574 -0.1828 0.2416 -0.1460 -0.1744 0.2612 -0.1419 -0.2419 -0.1537 -0.1302 -0.2086 0.1170 0.0981 0.0943 0.0883 0.0955 0.0935 0.1029 0.0957 0.1211 0.0914 0.1040 0.0877 0.0948 0.0944 0.1000 0.1268 0.1143 0.1324 0.1463 0.1618 0.1611 0.1508 0.1472 0.1564 0.1606 0.1609
va: 2.1098 2.0026 2.0507 3.7243 3.7197 3.8481 3.9066 3.8945 3.8298 4.1074 3.7825 3.9153 3.9399 3.7990 3.6209 4.0507 3.9202 3.7422 3.9027 3.9288 3.7617 3.8485 3.9839 3.8807 3.8974 3.9475 1.0043 1.0294 1.0021 1.0050 1.0019 1.0136 0.9991 1.0009 1.0214 1.0098 0.9973 0.9928 1.0152 0.9956 0.9966 0.9950 1.0087 1.0240 1.0068 0.9895 0.9939 0.9952 1.0081 0.9919 0.9873 0.9903
dispcorr: -0.027129634 hartree
energy: -1117.880150611006
dipole: -15.70093 15.74889 0.04795 -19.72576 19.18241 -0.54335 2.07277 -1.39071 0.68206
magnitude: 0.87334 au
magnitude: 2.21987 debye
