program: Orca
programVersion: 5.0.2
elementType: O O O C C C C C C C C C C C C C C C C C C C C C C C H H H H H H H H H H H H H H H H H H H H H H H H H H
charge: 0
multiplicity: 1
keywords: wb97x-d3
keywords: def2-TZVPP
keywords: def2/J RIJCOSX
keywords: DEFGRID2
keywords: scfconv7
keywords: smallprint printgap noloewdin
keywords: NOSOSCF
formula: C23H26O3
InChI: InChI=1/C23H26O3/c1-16(2)13-20-21(23(20,3)4)22(24)25-15-17-9-8-12-19(14-17)26-18-10-6-5-7-11-18/h5-14,20-21H,15H2,1-4H3
52 atoms
O  -1.712183 1.473989 -0.528053
O  -2.51137 -0.304837 -1.628238
O  3.220794 1.560377 0.775261
C  -4.2377 -0.804031 0.912312
C  -2.940649 -1.469905 1.208033
C  -2.952349 -0.020081 0.714363
C  -5.069191 -0.349745 2.089165
C  -5.077521 -1.247676 -0.259769
C  -2.413772 -2.590405 0.388581
C  -2.399367 0.327589 -0.603016
C  -1.119577 -2.835532 0.169211
C  -0.673536 -4.020146 -0.631716
C  -0.016335 -1.962259 0.680832
C  -1.017329 1.95305 -1.681522
C  0.311165 2.502663 -1.252712
C  1.138837 1.750299 -0.424811
C  0.739229 3.741265 -1.714207
C  2.388159 2.240446 -0.076645
C  1.992084 4.220813 -1.356317
C  2.825991 3.473957 -0.540189
C  3.339878 0.196473 0.665694
C  3.394177 -0.532918 1.844664
C  3.468195 -0.433618 -0.56625
C  3.591127 -1.905964 1.788759
C  3.649874 -1.808679 -0.606738
C  3.713825 -2.550307 0.565769
H  -2.681714 -1.524383 2.262464
H  -2.743629 0.718333 1.479128
H  -4.448605 -0.027783 2.926157
H  -5.707502 -1.162313 2.441465
H  -5.716171 0.484571 1.812005
H  -5.780641 -2.014067 0.07218
H  -4.506214 -1.666523 -1.082936
H  -5.664633 -0.414318 -0.649432
H  -3.146124 -3.274678 -0.030723
H  -0.085987 -3.705558 -1.49802
H  -1.513006 -4.615084 -0.990771
H  -0.024967 -4.671675 -0.040721
H  0.584592 -1.580196 -0.148879
H  0.664572 -2.535775 1.314454
H  -0.372997 -1.112187 1.259359
H  -1.621606 2.725913 -2.159636
H  -0.871132 1.150073 -2.404858
H  0.810149 0.786279 -0.05428
H  0.094001 4.33215 -2.35214
H  2.323781 5.185189 -1.717357
H  3.803814 3.843519 -0.259374
H  3.292333 -0.028497 2.797103
H  3.433884 0.135926 -1.486321
H  3.637072 -2.472903 2.709175
H  3.750403 -2.299991 -1.565552
H  3.858314 -3.621538 0.525646
elementType: O C H
totalener: -1117.85287677 hartree
nucrepener: 2316.94614510 hartree
electener: -3434.79902187 hartree
oneelecener: -6123.66680653 hartree
twoeener: 2688.86778466 hartree
cpcmener: -0.03075231 hartree
kineticenergy: 1112.80258093 hartree
xcener: -110.230587866426 hartree
chargesum: -0.0000000
charge: -0.295433 -0.496368 -0.343293 0.138093 -0.000938 -0.112477 -0.264691 -0.303081 -0.297191 0.417156 0.022340 -0.234120 -0.315754 0.070742 -0.013006 -0.156065 -0.203602 0.244577 -0.114646 -0.251326 0.259573 -0.210649 -0.170444 -0.154013 -0.157291 -0.173639 0.114743 0.096541 0.088167 0.094254 0.095570 0.099391 0.095167 0.102926 0.123653 0.095832 0.092573 0.095956 0.094558 0.119721 0.102854 0.116041 0.114810 0.136399 0.144136 0.160287 0.148218 0.146848 0.156444 0.159972 0.160903 0.159583
qa: -0.2954 -0.4964 -0.3433 0.1381 -0.0009 -0.1125 -0.2647 -0.3031 -0.2972 0.4172 0.0223 -0.2341 -0.3158 0.0707 -0.0130 -0.1561 -0.2036 0.2446 -0.1146 -0.2513 0.2596 -0.2106 -0.1704 -0.1540 -0.1573 -0.1736 0.1147 0.0965 0.0882 0.0943 0.0956 0.0994 0.0952 0.1029 0.1237 0.0958 0.0926 0.0960 0.0946 0.1197 0.1029 0.1160 0.1148 0.1364 0.1441 0.1603 0.1482 0.1468 0.1564 0.1600 0.1609 0.1596
va: 2.1148 1.9907 2.0583 3.7340 3.8014 3.8430 3.9000 3.8952 3.8688 4.0573 3.6855 3.9226 3.9746 3.8199 3.7442 3.8971 3.9340 3.7341 3.8933 4.0025 3.6831 3.9488 3.8738 3.8577 3.8632 3.8450 1.0062 1.0307 1.0047 1.0020 1.0020 0.9985 1.0148 1.0002 0.9998 0.9972 1.0079 0.9965 0.9934 0.9947 1.0052 0.9994 1.0151 1.0095 1.0036 0.9878 1.0060 1.0068 0.9968 0.9895 0.9905 0.9904
dispcorr: -0.028013464 hartree
energy: -1117.880890229215
dipole: -17.27372 17.33759 0.06387 -16.29655 16.37702 0.08047 3.16109 -2.71058 0.45051
magnitude: 0.46207 au
magnitude: 1.17450 debye
