program: Orca
programVersion: 5.0.2
elementType: O O O C C C C C C C C C C C C C C C C C C C C C C C H H H H H H H H H H H H H H H H H H H H H H H H H H
charge: 0
multiplicity: 1
keywords: wb97x-d3
keywords: def2-TZVPP
keywords: def2/J RIJCOSX
keywords: DEFGRID2
keywords: scfconv7
keywords: smallprint printgap noloewdin
keywords: NOSOSCF
formula: C23H26O3
InChI: InChI=1/C23H26O3/c1-16(2)13-20-21(23(20,3)4)22(24)25-15-17-9-8-12-19(14-17)26-18-10-6-5-7-11-18/h5-14,20-21H,15H2,1-4H3
52 atoms
O  -1.286179 1.090976 -1.192066
O  -1.286623 1.025882 1.040107
O  3.82978 0.598427 -0.89996
C  -1.838835 -2.030558 0.705557
C  -3.17682 -1.382519 0.696468
C  -2.071067 -0.855875 -0.229333
C  -1.711213 -3.364343 0.0076
C  -0.932248 -1.914494 1.905227
C  -3.698335 -0.587675 1.83251
C  -1.51152 0.484994 -0.018449
C  -4.645204 0.345024 1.699012
C  -5.190822 1.090461 2.876152
C  -5.209172 0.705315 0.352964
C  -0.739567 2.409534 -1.159145
C  0.668812 2.44431 -0.63496
C  1.584019 1.472834 -1.025105
C  1.067563 3.463988 0.221034
C  2.879486 1.514558 -0.530074
C  2.375472 3.51292 0.681098
C  3.286753 2.532605 0.320699
C  3.504104 -0.726953 -1.041323
C  2.608045 -1.37267 -0.197351
C  4.167529 -1.427352 -2.039229
C  2.37826 -2.730631 -0.368291
C  3.935082 -2.786858 -2.190337
C  3.037035 -3.443996 -1.36085
H  -3.942195 -1.906601 0.128502
H  -2.188291 -1.120771 -1.27319
H  -1.968424 -4.177364 0.689399
H  -0.687735 -3.52953 -0.335144
H  -2.369643 -3.436287 -0.858914
H  -1.135887 -2.738903 2.59143
H  -1.047011 -0.990454 2.464054
H  0.113805 -1.992686 1.602326
H  -3.310273 -0.805812 2.822709
H  -5.016054 2.164553 2.772869
H  -4.743052 0.763963 3.814578
H  -6.273444 0.962324 2.953522
H  -5.931656 1.517943 0.423122
H  -5.717271 -0.142267 -0.113122
H  -4.427215 1.020871 -0.341731
H  -1.381536 3.078667 -0.582238
H  -0.769367 2.74082 -2.197448
H  1.28655 0.684938 -1.706715
H  0.354091 4.216468 0.532521
H  2.684554 4.308143 1.346433
H  4.302403 2.555337 0.694158
H  2.094269 -0.835506 0.589944
H  4.864724 -0.912481 -2.68791
H  1.6812 -3.233274 0.289929
H  4.456089 -3.330418 -2.967381
H  2.853795 -4.502893 -1.483962
elementType: O C H
totalener: -1117.85168540 hartree
nucrepener: 2320.60533650 hartree
electener: -3438.45702190 hartree
oneelecener: -6131.33430736 hartree
twoeener: 2692.87728546 hartree
cpcmener: -0.03289107 hartree
kineticenergy: 1112.80119478 hartree
xcener: -110.229295564412 hartree
chargesum: -0.0000000
charge: -0.308315 -0.490744 -0.341364 0.129385 -0.033187 -0.066661 -0.264371 -0.297858 -0.279691 0.388965 -0.012037 -0.224016 -0.274419 0.106668 0.039136 -0.250726 -0.231879 0.290401 -0.112073 -0.264467 0.302149 -0.196064 -0.267176 -0.140671 -0.112618 -0.211526 0.118168 0.094122 0.096867 0.092184 0.089378 0.106736 0.095290 0.087842 0.127662 0.098151 0.086443 0.098907 0.098832 0.102221 0.096647 0.116114 0.123494 0.142050 0.144854 0.160918 0.148961 0.158113 0.147801 0.170291 0.161125 0.159987
qa: -0.3083 -0.4907 -0.3414 0.1294 -0.0332 -0.0667 -0.2644 -0.2979 -0.2797 0.3890 -0.0120 -0.2240 -0.2744 0.1067 0.0391 -0.2507 -0.2319 0.2904 -0.1121 -0.2645 0.3021 -0.1961 -0.2672 -0.1407 -0.1126 -0.2115 0.1182 0.0941 0.0969 0.0922 0.0894 0.1067 0.0953 0.0878 0.1277 0.0982 0.0864 0.0989 0.0988 0.1022 0.0966 0.1161 0.1235 0.1421 0.1449 0.1609 0.1490 0.1581 0.1478 0.1703 0.1611 0.1600
va: 2.0892 1.9886 2.0679 3.7604 3.8315 3.8081 3.8986 3.8912 3.8042 4.0505 3.6858 3.9197 3.9501 3.7951 3.6135 3.9336 3.9635 3.6973 3.8833 4.0164 3.7086 3.8987 4.0124 3.8552 3.8756 3.9424 1.0019 1.0318 1.0014 1.0059 1.0059 0.9995 1.0187 1.0084 0.9992 0.9937 1.0083 0.9933 1.0056 0.9973 1.0017 1.0070 0.9923 1.0171 1.0027 0.9878 1.0058 0.9962 1.0080 0.9830 0.9871 0.9918
dispcorr: -0.027284217 hartree
energy: -1117.878969621332
dipole: -24.78032 23.79654 -0.98378 -9.13929 8.57654 -0.56276 8.69254 -9.48798 -0.79543
magnitude: 1.38464 au
magnitude: 3.51948 debye
