program: Gaussian 09
title: 000069490
version: EM64L-G09RevD.01
frameworkgroup: C1[X(C6H13NO2)]
method: RPBEPBE
basis: SDD
operation: Freq
keyword: #p
keyword: freq=noraman
keyword: PBEPBE/SDD
title: #p freq=noraman PBEPBE/SDD
converged: NO NO NO NO
title: Mulliken charges:
elementType: O O N C C C C C C H H H H H H H H H H H H H
charge: -0.294610 -0.284663 -0.618519 -0.344453 -0.384723 -0.349963 -0.265372 -0.691478 0.290278 0.189321 0.189345 0.207325 0.207329 0.196196 0.196255 0.223139 0.223174 0.210424 0.210410 0.217165 0.334354 0.339064
chargesum: 0.00000
title: Mulliken charges with hydrogens summed into heavy atoms:
elementType: O O N C C C C C C
charge: -0.294610 -0.284663 0.054899 0.034214 0.029932 0.042488 0.180940 -0.053478 0.290278
polarizability: 1.06137618e+02 -2.71439163e+00 7.56062219e+01 -1.47755892e-02 4.89465833e-03 5.78013131e+01
1716.lowfreq: 0.0006 0.0007 0.0011 4.2669 9.0227 29.6310 41.3266 66.8639 75.5551
frequency: 39.0801 63.2640 75.5490 102.6492 122.6606 169.9370 189.8044 227.6960 249.1910 340.4804 437.0327 485.8364 488.5308 518.4368 621.2825 706.7321 734.2598 767.6473 826.0493 847.1266 896.7331 968.4105 1004.6380 1024.9901 1056.1431 1070.7413 1077.6688 1125.9341 1152.9475 1203.5930 1252.5181 1258.3833 1282.5266 1294.5567 1297.3309 1323.9460 1357.3082 1387.1350 1390.7243 1469.2920 1470.2006 1476.3813 1478.0562 1486.6770 1493.7094 1585.1763 1678.1141 2956.7168 2968.5787 2971.4087 2987.1684 2995.7604 2996.3940 3022.4072 3040.2826 3066.1740 3070.8108 3071.4987 3559.5852 3719.0872
redmass: 3.7938 2.2406 4.0261 2.1738 2.0820 3.0748 3.9838 1.1186 4.8048 3.0701 3.3193 1.1877 2.9517 1.0470 5.9698 10.9164 1.0688 1.1068 4.6672 1.1761 1.9338 1.1553 5.1355 4.8492 2.0595 2.3378 2.6237 2.6171 1.4859 1.4257 1.2910 1.2127 1.1021 1.0854 2.1023 1.5777 1.6031 1.5431 1.3087 1.0723 1.0716 1.0423 1.0668 1.0805 1.0928 1.2251 7.0359 1.0587 1.0592 1.0365 1.0596 1.0568 1.0987 1.1026 1.1046 1.1033 1.1050 1.0993 1.0442 1.1060
irintensity: 0.0193 2.5069 1.7615 0.5400 3.5574 7.1122 6.8171 0.0099 2.6420 5.8208 8.8216 324.7091 0.9578 10.9953 0.9504 32.7321 11.1885 0.0094 19.3151 0.7056 18.3116 1.2919 63.6329 79.2455 35.4004 25.7070 19.7408 0.9991 0.5810 0.5273 0.6956 0.1054 0.5292 0.6502 358.4248 100.4325 1.5466 37.8731 3.3523 0.1819 0.3570 12.8366 2.9124 1.6000 22.1374 99.8880 371.6023 5.3591 53.4209 33.7487 10.6915 60.7498 0.8942 16.5261 5.1248 3.3936 161.4715 51.6557 58.7831 47.9283
temp: 298.150 k
press: 1.00000 atm
elementType: 8 8 7 6 6 6 6 6 6 1 1 1 1 1 1 1 1 1 1 1 1 1
symmnumber: 1
zpe: 496467.9 jmol-1
zpe.correction: 0.189095 hartree
zpe.thermalcorrener: 0.200342 hartree
zpe.thermalcorrenthalpy: 0.201286 hartree
zpe.thermalcorrgfe: 0.151115 hartree
zpe.sumelectzpe: -440.910677 hartree
zpe.sumelectthermal: -440.899429 hartree
zpe.sumelectthermalent: -440.898485 hartree
zpe.sumelectthermalfe: -440.948656 hartree
dipole: -0.4033 -2.5881 -0.0008
dipole: 2.6193
quadrupole: -47.0468 -58.2915 -55.7527
quadrupole: -11.4044 -0.0114 0.0057
quadrupole: 6.6502 -4.5945 -2.0557 -11.4044 -0.0114 0.0057
hfenergy: -441.0997716 hartree
pointgroup: C01 [X(C6H13N1O2)]
dipole: -0.1732918 1.0158317 -0.004106 debye
dipolederiv: -1.8455142 0.0267375 -0.0043235 0.2441508 -0.5061648 0.0014727 -0.0053081 0.0009027 -0.3063075 -0.7351711 0.0701944 -0.0013202 0.1727148 -1.0704507 0.0031404 -0.0017506 0.0028722 -0.3616253 -0.9988588 -0.4830395 0.0011846 -0.5089739 -0.7049985 -0.0016655 0.0011572 -0.0015878 -0.7526516 -0.0367359 0.0166493 -0.0004365 0.0961864 0.0717009 0.0008762 -0.0008037 0.0006975 0.1883567 -0.126666 -0.0019282 -0.0004861 0.0046171 0.0709615 0.0001225 -0.000484 0.0001304 0.162616 0.0536029 -0.0111195 -0.0001209 -0.0746303 0.1019686 0.0002164 0.0002528 0.0004824 0.1758643 0.926141 0.108177 0.0011136 0.2602142 0.2766843 0.0012336 0.0005221 0.0007331 0.3698106 -0.0809658 -0.0447016 -0.0000086 -0.0052119 0.0504855 0.0003321 -0.0001783 0.0002088 0.0950969 2.226787 0.2381238 0.0045764 -0.1288596 1.6372518 -0.005243 0.0062561 -0.0042721 0.3370624 0.0416432 0.0027235 -0.0021544 -0.0062651 -0.0427653 0.1165233 0.0008526 0.1407977 -0.0900472 0.0417431 0.0033777 0.0026463 -0.005751 -0.0453254 -0.1170357 -0.0002471 -0.141244 -0.0874363 0.0595565 0.0017272 0.0077686 0.0075839 -0.0244752 -0.1061434 -0.0031528 -0.1243295 -0.0734028 0.0594974 0.0013883 -0.007369 0.0073484 -0.022859 0.10586 0.0034592 0.1240285 -0.0751406 0.026617 -0.0230105 -0.0244344 0.0040084 -0.0467432 -0.1231022 -0.0022171 -0.1512125 -0.088126 0.0265063 -0.0230925 0.024993 0.0037557 -0.0435811 0.1226329 0.0024714 0.1506269 -0.0911791 -0.0244287 -0.0094962 0.0119011 -0.0692479 -0.0152729 -0.0827085 -0.004796 -0.1032269 -0.070342 -0.0241232 -0.0100879 -0.0116673 -0.0696876 -0.0142004 0.0819343 0.0054239 0.1027286 -0.0712771 0.0802882 0.000139 0.0228064 -0.0484365 -0.0176865 -0.1225052 -0.0245558 -0.1384593 -0.087361 0.0803216 -0.0003502 -0.022471 -0.0483669 -0.0148205 0.1215794 0.0254098 0.1376569 -0.0902485 -0.1754709 0.0978591 -0.0008897 0.1334541 0.0045761 0.0006581 -0.001024 0.0006168 0.100774 0.2098914 0.007658 -0.0006308 0.043257 0.183309 0.0009702 -0.0007639 0.0008661 0.4103789 0.215339 0.0320711 -0.0006775 -0.01186 0.1724058 0.0008515 -0.0005237 0.0009835 0.4051852 unknown
polarizability: 106.0530611|3.1522503|75.6903105|0.1037257|-0.0597588|57.801781 unknown
InChI: InChI=1S/C6H13NO2/c1-2-3-4-5-9-6(7)8/h2-5,7H2,1H3
charge 0 multiplicity 1
22 atoms
O  1.533656 0.560288 0.001189
O  2.962657 -1.318446 0.012622
N  3.785604 0.883325 0.006731
C  -2.180066 -0.342157 -0.002517
C  -0.891363 0.513847 -0.004004
C  -3.467513 0.514285 -0.009284
C  0.365823 -0.357476 0.001069
C  -4.753892 -0.339421 -0.005963
C  2.790713 -0.072444 0.0074
H  -2.188134 -1.003703 0.889182
H  -2.184625 -1.012657 -0.887483
H  -0.878385 1.175532 0.883907
H  -0.87587 1.169124 -0.896598
H  -3.462986 1.184818 0.874472
H  -3.460643 1.174492 -0.900752
H  0.422169 -1.0092 -0.891594
H  0.418221 -1.004475 0.897399
H  -4.795614 -0.996492 -0.8955
H  -4.797409 -0.986626 0.890688
H  -5.659961 0.29421 -0.010333
H  3.550088 1.872302 0.00233
H  4.75343 0.574875 0.010739
