program: Orca
programVersion: 5.0.2
elementType: O O O C C C C C C C C C C C C C C C C C C C C C C C H H H H H H H H H H H H H H H H H H H H H H H H H H
charge: 0
multiplicity: 1
keywords: wb97x-d3
keywords: def2-TZVPP
keywords: def2/J RIJCOSX
keywords: DEFGRID2
keywords: scfconv7
keywords: smallprint printgap noloewdin
keywords: NOSOSCF
formula: C23H26O3
InChI: InChI=1/C23H26O3/c1-16(2)13-20-21(23(20,3)4)22(24)25-15-17-9-8-12-19(14-17)26-18-10-6-5-7-11-18/h5-14,20-21H,15H2,1-4H3
52 atoms
O  -2.278414 1.902835 -0.502648
O  -2.362971 0.046433 -1.75349
O  2.715416 0.07442 -1.065685
C  -4.490193 -1.003733 0.21183
C  -3.202722 -1.259001 0.912049
C  -3.503766 0.141133 0.351129
C  -5.721019 -0.860814 1.077998
C  -4.799093 -1.639606 -1.121723
C  -2.114614 -2.086802 0.338646
C  -2.6807 0.651744 -0.754304
C  -0.833489 -1.985775 0.703819
C  0.232177 -2.825091 0.071334
C  -0.355824 -0.994178 1.720834
C  -1.452332 2.583039 -1.459024
C  0.002744 2.501921 -1.091471
C  0.707824 1.304372 -1.20579
C  0.66345 3.636074 -0.634643
C  2.051375 1.261473 -0.875753
C  2.014463 3.582455 -0.314951
C  2.720054 2.397707 -0.43628
C  3.434705 -0.481296 -0.040966
C  4.412192 -1.399084 -0.406213
C  3.190176 -0.206786 1.298973
C  5.149877 -2.040369 0.576826
C  3.943382 -0.851934 2.270865
C  4.924352 -1.768203 1.919867
H  -3.261531 -1.273248 1.997123
H  -3.757743 0.886998 1.094667
H  -6.478612 -0.251654 0.581683
H  -5.493673 -0.394075 2.03705
H  -6.160942 -1.839136 1.279984
H  -5.338232 -2.573694 -0.954001
H  -3.925418 -1.872954 -1.721985
H  -5.447603 -0.992272 -1.714131
H  -2.380911 -2.811004 -0.424877
H  0.741038 -3.446091 0.812755
H  1.001645 -2.193639 -0.381084
H  -0.165431 -3.478909 -0.704781
H  0.027677 -0.095906 1.229814
H  0.465351 -1.401866 2.310904
H  -1.137138 -0.676921 2.408474
H  -1.782797 3.620419 -1.436449
H  -1.628992 2.198791 -2.463486
H  0.223976 0.405594 -1.567101
H  0.124026 4.569865 -0.537404
H  2.524049 4.473202 0.027451
H  3.775016 2.359392 -0.196081
H  4.589667 -1.609802 -1.453201
H  2.422516 0.494738 1.596808
H  5.909904 -2.754123 0.28727
H  3.751522 -0.633645 3.313221
H  5.506439 -2.265422 2.683923
elementType: O C H
totalener: -1117.85183032 hartree
nucrepener: 2332.23705025 hartree
electener: -3450.08888057 hartree
oneelecener: -6154.56646127 hartree
twoeener: 2704.47758070 hartree
cpcmener: -0.02919869 hartree
kineticenergy: 1112.80535643 hartree
xcener: -110.230397892206 hartree
chargesum: 0.0000000
charge: -0.296960 -0.499727 -0.337782 0.128336 -0.027638 -0.097437 -0.266291 -0.293654 -0.259101 0.418793 -0.004747 -0.233896 -0.293418 0.082974 0.019289 -0.273746 -0.200645 0.259304 -0.130329 -0.190000 0.310858 -0.256117 -0.208166 -0.122559 -0.167180 -0.188258 0.111111 0.091455 0.096202 0.088223 0.094914 0.098063 0.089340 0.102995 0.128195 0.102243 0.081633 0.096894 0.095000 0.103578 0.111444 0.114698 0.117432 0.148332 0.146312 0.162651 0.158347 0.146193 0.160395 0.160000 0.161442 0.161006
qa: -0.2970 -0.4997 -0.3378 0.1283 -0.0276 -0.0974 -0.2663 -0.2937 -0.2591 0.4188 -0.0047 -0.2339 -0.2934 0.0830 0.0193 -0.2737 -0.2006 0.2593 -0.1303 -0.1900 0.3109 -0.2561 -0.2082 -0.1226 -0.1672 -0.1883 0.1111 0.0915 0.0962 0.0882 0.0949 0.0981 0.0893 0.1030 0.1282 0.1022 0.0816 0.0969 0.0950 0.1036 0.1114 0.1147 0.1174 0.1483 0.1463 0.1627 0.1583 0.1462 0.1604 0.1600 0.1614 0.1610
va: 2.1116 1.9833 2.0276 3.7666 3.8082 3.8597 3.8996 3.8909 3.8142 4.0617 3.6457 3.9262 3.9605 3.8066 3.6802 3.9720 3.9668 3.7611 3.8883 3.9403 3.5570 3.9951 3.8449 3.8839 3.9227 3.8968 1.0065 1.0327 1.0024 1.0043 1.0022 0.9991 1.0185 0.9997 1.0000 0.9963 0.9970 1.0112 0.9966 0.9998 1.0075 1.0002 1.0163 1.0255 1.0022 0.9886 0.9959 1.0088 0.9928 0.9881 0.9903 0.9890
dispcorr: -0.029131770 hartree
energy: -1117.880962090292
dipole: -15.27149 15.26221 -0.00928 -11.13189 12.04180 0.90991 8.08504 -6.66892 1.41612
magnitude: 1.68327 au
magnitude: 4.27854 debye
