program: Orca
programVersion: 5.0.2
elementType: O O O C C C C C C C C C C C C C C C C C C C C C C C H H H H H H H H H H H H H H H H H H H H H H H H H H
charge: 0
multiplicity: 1
keywords: wb97x-d3
keywords: def2-TZVPP
keywords: def2/J RIJCOSX
keywords: DEFGRID2
keywords: scfconv7
keywords: smallprint printgap noloewdin
keywords: NOSOSCF
formula: C23H26O3
InChI: InChI=1/C23H26O3/c1-16(2)13-20-21(23(20,3)4)22(24)25-15-17-9-8-12-19(14-17)26-18-10-6-5-7-11-18/h5-14,20-21H,15H2,1-4H3
52 atoms
O  -2.392267 1.832317 -1.446161
O  -1.753749 -0.303243 -1.555905
O  3.275499 0.44466 -1.2854
C  -4.424618 -1.034971 -0.191028
C  -3.5860 -0.528859 0.93203
C  -3.740294 0.303643 -0.35536
C  -5.922471 -0.936238 -0.009707
C  -4.022844 -2.249863 -0.991432
C  -2.282185 -1.119964 1.313189
C  -2.544629 0.530278 -1.177153
C  -1.433614 -0.549345 2.173862
C  -0.154159 -1.215704 2.574249
C  -1.701469 0.777354 2.821994
C  -1.17793 2.227368 -2.093858
C  0.013197 2.04905 -1.194155
C  1.106098 1.305735 -1.622048
C  0.02251 2.610025 0.079441
C  2.201859 1.14212 -0.78908
C  1.12034 2.429022 0.908154
C  2.219658 1.697639 0.482788
C  3.858605 -0.5253 -0.508828
C  5.234986 -0.670105 -0.607451
C  3.111906 -1.368699 0.305194
C  5.869239 -1.669354 0.116894
C  3.762029 -2.355551 1.032395
C  5.139187 -2.510403 0.945367
H  -4.139144 -0.090782 1.757318
H  -4.37986 1.173023 -0.259457
H  -6.428467 -0.87365 -0.9747
H  -6.205786 -0.058974 0.573085
H  -6.303775 -1.817414 0.509267
H  -4.409772 -2.180777 -2.009364
H  -4.46292 -3.138741 -0.535745
H  -2.951677 -2.413583 -1.055445
H  -2.021339 -2.086185 0.893839
H  -0.104708 -1.345817 3.658672
H  0.706281 -0.598731 2.300303
H  -0.032888 -2.194721 2.110797
H  -0.772329 1.31316 3.017352
H  -2.192383 0.644396 3.789357
H  -2.337451 1.423357 2.219041
H  -1.327565 3.280146 -2.33078
H  -1.045932 1.690403 -3.034955
H  1.104992 0.848211 -2.604264
H  -0.822789 3.189535 0.429041
H  1.127509 2.869799 1.896267
H  3.075796 1.570131 1.132885
H  5.803179 -0.008342 -1.24838
H  2.035786 -1.268672 0.37183
H  6.942648 -1.780791 0.03862
H  3.180872 -3.011295 1.667209
H  5.638114 -3.282465 1.515262
elementType: O C H
totalener: -1117.85239413 hartree
nucrepener: 2325.58703126 hartree
electener: -3443.43942539 hartree
oneelecener: -6141.65529002 hartree
twoeener: 2698.21586463 hartree
cpcmener: -0.03202649 hartree
kineticenergy: 1112.81531018 hartree
xcener: -110.231324916225 hartree
chargesum: 0.0000000
charge: -0.296244 -0.492640 -0.346076 0.142953 -0.037203 -0.087619 -0.264798 -0.293050 -0.262161 0.391108 -0.019875 -0.229590 -0.308769 0.095367 0.040914 -0.242908 -0.241761 0.278285 -0.153996 -0.200918 0.264855 -0.232127 -0.184712 -0.136484 -0.173045 -0.176931 0.114977 0.093862 0.096167 0.087781 0.095263 0.103402 0.098210 0.088228 0.130525 0.110266 0.079483 0.094729 0.098970 0.123374 0.096761 0.126267 0.116444 0.133394 0.145427 0.164527 0.159149 0.147430 0.181783 0.160810 0.158635 0.161559
qa: -0.2962 -0.4926 -0.3461 0.1430 -0.0372 -0.0876 -0.2648 -0.2930 -0.2622 0.3911 -0.0199 -0.2296 -0.3088 0.0954 0.0409 -0.2429 -0.2418 0.2783 -0.1540 -0.2009 0.2649 -0.2321 -0.1847 -0.1365 -0.1730 -0.1769 0.1150 0.0939 0.0962 0.0878 0.0953 0.1034 0.0982 0.0882 0.1305 0.1103 0.0795 0.0947 0.0990 0.1234 0.0968 0.1263 0.1164 0.1334 0.1454 0.1645 0.1591 0.1474 0.1818 0.1608 0.1586 0.1616
va: 2.1070 1.9930 2.0538 3.7712 3.7927 3.8421 3.8958 3.8879 3.8192 4.1111 3.6623 3.9210 3.9518 3.7956 3.5893 4.0576 3.8933 3.6989 3.8379 3.8984 3.7151 3.9887 3.8764 3.8919 3.9093 3.8881 1.0019 1.0311 1.0022 1.0043 1.0023 0.9993 0.9996 1.0206 1.0013 0.9976 0.9928 1.0047 0.9998 0.9974 0.9988 0.9929 1.0083 1.0195 1.0096 0.9883 0.9957 1.0074 0.9719 0.9881 0.9941 0.9890
dispcorr: -0.028582512 hartree
energy: -1117.880976637016
dipole: -18.91604 18.15614 -0.75991 -7.85288 8.53224 0.67935 13.24814 -11.99530 1.25283
magnitude: 1.61511 au
magnitude: 4.10527 debye
