program: Orca
programVersion: 5.0.2
elementType: O O O C C C C C C C C C C C C C C C C C C C C C C C H H H H H H H H H H H H H H H H H H H H H H H H H H
charge: 0
multiplicity: 1
keywords: wb97x-d3
keywords: def2-TZVPP
keywords: def2/J RIJCOSX
keywords: DEFGRID2
keywords: scfconv7
keywords: smallprint printgap noloewdin
keywords: NOSOSCF
formula: C23H26O3
InChI: InChI=1/C23H26O3/c1-16(2)13-20-21(23(20,3)4)22(24)25-15-17-9-8-12-19(14-17)26-18-10-6-5-7-11-18/h5-14,20-21H,15H2,1-4H3
52 atoms
O  -1.712363 1.782598 -0.483633
O  -0.999608 0.685143 1.332993
O  2.901377 0.428934 -2.132516
C  -2.062999 -1.769081 -0.367742
C  -3.100741 -1.474499 0.658529
C  -2.555069 -0.33729 -0.19333
C  -2.495574 -2.436544 -1.650549
C  -0.665146 -2.147931 0.051886
C  -2.844953 -1.623126 2.114268
C  -1.681747 0.719589 0.334986
C  -3.397673 -0.882208 3.077169
C  -3.131079 -1.16066 4.524616
C  -4.301807 0.279397 2.806557
C  -0.904416 2.910445 -0.180508
C  0.50231 2.799809 -0.7081
C  1.041522 1.612566 -1.181722
C  1.284101 3.95542 -0.71441
C  2.357684 1.587444 -1.630246
C  2.585885 3.918882 -1.182503
C  3.139476 2.728397 -1.637214
C  2.85954 -0.711508 -1.370422
C  2.951396 -0.686077 0.016319
C  2.773666 -1.918566 -2.05176
C  2.956061 -1.884914 0.716177
C  2.787617 -3.108364 -1.338164
C  2.875397 -3.098886 0.047546
H  -4.115603 -1.728292 0.361032
H  -3.218235 0.006817 -0.97816
H  -1.832976 -2.165214 -2.474428
H  -3.51134 -2.157032 -1.932541
H  -2.466006 -3.522904 -1.545738
H  -0.59163 -3.233958 0.133945
H  -0.36276 -1.729323 1.00821
H  0.0592 -1.82819 -0.699968
H  -2.190754 -2.43996 2.406675
H  -2.45943 -2.00757 4.663586
H  -4.059884 -1.374948 5.059554
H  -2.686557 -0.291315 5.015702
H  -5.263067 0.146262 3.309339
H  -4.498446 0.434837 1.747407
H  -3.871209 1.200684 3.207734
H  -0.888918 3.10335 0.894696
H  -1.40464 3.757165 -0.650354
H  0.460545 0.699491 -1.225608
H  0.865186 4.888668 -0.357464
H  3.181857 4.821978 -1.189505
H  4.159523 2.690366 -1.996928
H  3.027954 0.250915 0.553004
H  2.701765 -1.92453 -3.132018
H  3.029604 -1.864231 1.795682
H  2.721362 -4.047201 -1.872291
H  2.881072 -4.028073 0.601367
elementType: O C H
totalener: -1117.85334255 hartree
nucrepener: 2342.40780636 hartree
electener: -3460.26114891 hartree
oneelecener: -6175.25714078 hartree
twoeener: 2714.99599187 hartree
cpcmener: -0.03224683 hartree
kineticenergy: 1112.78407029 hartree
xcener: -110.228795828911 hartree
chargesum: -0.0000000
charge: -0.297628 -0.482727 -0.343516 0.172099 -0.012593 -0.096517 -0.269952 -0.318480 -0.292532 0.370342 -0.024515 -0.225840 -0.265480 0.088379 0.013250 -0.186428 -0.219493 0.228922 -0.129320 -0.226777 0.260401 -0.166467 -0.212204 -0.175048 -0.144262 -0.174281 0.118143 0.097545 0.096958 0.089642 0.094707 0.111742 0.101956 0.068204 0.126303 0.089840 0.096127 0.094422 0.106849 0.094645 0.098976 0.117287 0.127888 0.166084 0.144825 0.160642 0.148892 0.153990 0.145799 0.161371 0.158591 0.159237
qa: -0.2976 -0.4827 -0.3435 0.1721 -0.0126 -0.0965 -0.2700 -0.3185 -0.2925 0.3703 -0.0245 -0.2258 -0.2655 0.0884 0.0132 -0.1864 -0.2195 0.2289 -0.1293 -0.2268 0.2604 -0.1665 -0.2122 -0.1750 -0.1443 -0.1743 0.1181 0.0975 0.0970 0.0896 0.0947 0.1117 0.1020 0.0682 0.1263 0.0898 0.0961 0.0944 0.1068 0.0946 0.0990 0.1173 0.1279 0.1661 0.1448 0.1606 0.1489 0.1540 0.1458 0.1614 0.1586 0.1592
va: 2.1101 1.9894 2.0560 3.7304 3.8502 3.8338 3.8986 3.8954 3.8494 4.0975 3.6997 3.9247 3.9418 3.8387 3.6643 3.9314 3.9569 3.7724 3.8815 3.9942 3.6855 3.8345 3.9425 3.8600 3.8775 3.8405 1.0019 1.0308 1.0006 1.0054 1.0018 0.9999 1.0070 1.0125 1.0000 1.0071 0.9963 0.9967 0.9996 1.0057 0.9983 1.0109 0.9932 0.9810 0.9995 0.9882 1.0043 0.9999 1.0079 0.9911 0.9893 0.9904
dispcorr: -0.028388040 hartree
energy: -1117.881730590706
dipole: -18.67092 17.69591 -0.97501 -11.61585 11.80502 0.18917 12.31883 -12.50971 -0.19087
magnitude: 1.01137 au
magnitude: 2.57069 debye
