program: Orca
programVersion: 5.0.2
elementType: O O O C C C C C C C C C C C C C C C C C C C C C C C H H H H H H H H H H H H H H H H H H H H H H H H H H
charge: 0
multiplicity: 1
keywords: wb97x-d3
keywords: def2-TZVPP
keywords: def2/J RIJCOSX
keywords: DEFGRID2
keywords: scfconv7
keywords: smallprint printgap noloewdin
keywords: NOSOSCF
formula: C23H26O3
InChI: InChI=1/C23H26O3/c1-16(2)13-20-21(23(20,3)4)22(24)25-15-17-9-8-12-19(14-17)26-18-10-6-5-7-11-18/h5-14,20-21H,15H2,1-4H3
52 atoms
O  -1.841239 0.171462 -1.306691
O  -2.904121 2.130789 -1.221976
O  2.99085 0.621982 1.006031
C  -4.359735 -1.105461 -0.144444
C  -3.548873 -0.703414 1.037644
C  -3.847854 0.322718 -0.056773
C  -5.85171 -1.241075 0.055042
C  -3.820289 -2.086309 -1.156515
C  -2.199354 -1.25505 1.317784
C  -2.82987 0.959509 -0.909104
C  -1.234853 -0.613776 1.981955
C  0.05789 -1.286957 2.326866
C  -1.349823 0.812827 2.42355
C  -0.793311 0.734277 -2.114237
C  0.228048 1.441083 -1.269853
C  1.149832 0.687556 -0.549935
C  0.253243 2.829292 -1.177961
C  2.08934 1.325506 0.247988
C  1.189354 3.454313 -0.367131
C  2.113152 2.708594 0.349246
C  3.633109 -0.45821 0.452935
C  4.159833 -0.414233 -0.832233
C  3.792034 -1.584376 1.247513
C  4.849098 -1.515465 -1.318782
C  4.491902 -2.675318 0.750224
C  5.018971 -2.648471 -0.533565
H  -4.12772 -0.491534 1.933649
H  -4.6051 1.047836 0.217475
H  -6.389307 -1.078582 -0.880981
H  -6.231039 -0.526261 0.786285
H  -6.099232 -2.242993 0.411094
H  -4.208578 -1.866374 -2.152373
H  -4.154432 -3.091657 -0.893141
H  -2.736255 -2.114404 -1.218345
H  -2.017843 -2.280465 1.007835
H  0.142253 -1.42575 3.408257
H  0.911947 -0.675554 2.032903
H  0.157486 -2.263873 1.854248
H  -1.017025 0.930728 3.457617
H  -2.362058 1.207133 2.347991
H  -0.697636 1.449438 1.815954
H  -1.205067 1.393211 -2.878771
H  -0.348515 -0.124409 -2.613817
H  1.132236 -0.394448 -0.61827
H  -0.452793 3.423026 -1.743021
H  1.208334 4.533794 -0.297565
H  2.850149 3.193817 0.976278
H  4.042582 0.467987 -1.448806
H  3.374642 -1.604913 2.24645
H  5.261304 -1.481361 -2.31873
H  4.616678 -3.552758 1.371039
H  5.560137 -3.502142 -0.919015
elementType: O C H
totalener: -1117.85028501 hartree
nucrepener: 2344.62548971 hartree
electener: -3462.47577472 hartree
oneelecener: -6179.01316605 hartree
twoeener: 2716.53739133 hartree
cpcmener: -0.03018495 hartree
kineticenergy: 1112.80386405 hartree
xcener: -110.229539879322 hartree
chargesum: -0.0000000
charge: -0.267797 -0.512188 -0.351013 0.150108 -0.019617 -0.166188 -0.270157 -0.295733 -0.268100 0.454821 -0.021481 -0.224970 -0.256339 0.056396 -0.011642 -0.190731 -0.168323 0.260304 -0.142636 -0.236693 0.272344 -0.171997 -0.249195 -0.159690 -0.131763 -0.182230 0.113150 0.093911 0.095524 0.087526 0.094093 0.104896 0.097785 0.091735 0.124507 0.110228 0.060918 0.097360 0.109733 0.099255 0.080840 0.122014 0.119443 0.148355 0.143686 0.160126 0.149628 0.157183 0.157381 0.162291 0.161273 0.161668
qa: -0.2678 -0.5122 -0.3510 0.1501 -0.0196 -0.1662 -0.2702 -0.2957 -0.2681 0.4548 -0.0215 -0.2250 -0.2563 0.0564 -0.0116 -0.1907 -0.1683 0.2603 -0.1426 -0.2367 0.2723 -0.1720 -0.2492 -0.1597 -0.1318 -0.1822 0.1131 0.0939 0.0955 0.0875 0.0941 0.1049 0.0978 0.0917 0.1245 0.1102 0.0609 0.0974 0.1097 0.0993 0.0808 0.1220 0.1194 0.1484 0.1437 0.1601 0.1496 0.1572 0.1574 0.1623 0.1613 0.1617
va: 2.1181 1.9855 2.0221 3.7110 3.7987 3.8625 3.9059 3.9013 3.8349 4.0897 3.6964 3.9129 3.9465 3.8249 3.6257 3.8820 3.9150 3.6347 3.9351 4.0238 3.6928 3.8949 3.9683 3.8945 3.8978 3.8971 1.0050 1.0295 1.0017 1.0053 1.0018 1.0004 0.9989 1.0093 1.0003 0.9993 1.0072 1.0058 1.0005 1.0054 1.0037 1.0080 1.0000 1.0054 1.0147 0.9890 1.0050 0.9970 0.9999 0.9896 0.9889 0.9890
dispcorr: -0.029750603 hartree
energy: -1117.880035617450
dipole: -15.83722 16.22716 0.38993 -10.89028 9.51834 -1.37194 5.30879 -5.47297 -0.16419
magnitude: 1.43570 au
magnitude: 3.64925 debye
