program: Orca
programVersion: 5.0.2
elementType: O O O C C C C C C C C C C C C C C C C C C C C C C C H H H H H H H H H H H H H H H H H H H H H H H H H H
charge: 0
multiplicity: 1
keywords: wb97x-d3
keywords: def2-TZVPP
keywords: def2/J RIJCOSX
keywords: DEFGRID2
keywords: scfconv7
keywords: smallprint printgap noloewdin
keywords: NOSOSCF
formula: C23H26O3
InChI: InChI=1/C23H26O3/c1-16(2)13-20-21(23(20,3)4)22(24)25-15-17-9-8-12-19(14-17)26-18-10-6-5-7-11-18/h5-14,20-21H,15H2,1-4H3
52 atoms
O  -1.925758 1.44715 -1.807537
O  -0.971792 -0.519951 -1.34855
O  3.50673 1.115308 -0.186814
C  -3.732871 -1.321156 -0.163582
C  -3.070451 -0.609585 0.974524
C  -3.115316 0.038637 -0.417079
C  -5.243826 -1.332688 -0.171231
C  -3.143709 -2.585045 -0.739996
C  -1.819302 -1.074728 1.600955
C  -1.898034 0.248158 -1.216603
C  -1.540668 -1.049763 2.910357
C  -0.239283 -1.593151 3.420086
C  -2.442721 -0.520915 3.983552
C  -0.755118 1.871342 -2.524337
C  0.318236 2.297856 -1.564868
C  1.439757 1.504304 -1.36675
C  0.163303 3.470188 -0.829491
C  2.380636 1.865615 -0.411723
C  1.123274 3.835695 0.10044
C  2.231099 3.029802 0.325722
C  3.424025 -0.254968 -0.172817
C  2.3260 -0.934431 0.343309
C  4.524224 -0.950448 -0.655148
C  2.33826 -2.322034 0.359628
C  4.524011 -2.3377 -0.62436
C  3.430309 -3.03033 -0.123769
H  -3.761538 -0.1228 1.652735
H  -3.824455 0.853887 -0.497891
H  -5.628127 -1.441965 -1.187169
H  -5.660643 -0.415955 0.246799
H  -5.622238 -2.169651 0.418703
H  -3.405904 -2.685442 -1.795036
H  -3.567766 -3.444555 -0.216686
H  -2.063445 -2.657893 -0.658233
H  -1.067492 -1.505644 0.950426
H  0.385048 -1.991708 2.621174
H  -0.405483 -2.392974 4.146141
H  0.331658 -0.819771 3.939893
H  -1.919751 0.223401 4.588215
H  -2.729715 -1.322588 4.668336
H  -3.357044 -0.062179 3.61408
H  -1.095079 2.710573 -3.12857
H  -0.407398 1.088243 -3.198835
H  1.56812 0.601683 -1.950869
H  -0.705029 4.097856 -0.987123
H  1.006966 4.74968 0.667599
H  2.97349 3.303382 1.064492
H  1.468621 -0.399462 0.732964
H  5.373204 -0.408356 -1.052131
H  1.479772 -2.851304 0.752603
H  5.385267 -2.876401 -0.996954
H  3.429909 -4.111793 -0.106442
elementType: O C H
totalener: -1117.85315926 hartree
nucrepener: 2325.84802494 hartree
electener: -3443.70118420 hartree
oneelecener: -6142.19567809 hartree
twoeener: 2698.49449389 hartree
cpcmener: -0.02960221 hartree
kineticenergy: 1112.79934045 hartree
xcener: -110.228820404985 hartree
chargesum: 0.0000000
charge: -0.297133 -0.501661 -0.342578 0.104771 0.021612 -0.101425 -0.264161 -0.282664 -0.275487 0.428915 -0.057644 -0.220208 -0.258738 0.091549 -0.002935 -0.182187 -0.243391 0.275452 -0.116664 -0.250618 0.289805 -0.188137 -0.258559 -0.129586 -0.121845 -0.207057 0.120306 0.096893 0.094495 0.087981 0.095114 0.103234 0.096413 0.093231 0.113899 0.075317 0.101463 0.098379 0.095678 0.099116 0.089652 0.129175 0.114896 0.142818 0.146805 0.161771 0.148990 0.151735 0.147626 0.162909 0.161316 0.161358
qa: -0.2971 -0.5017 -0.3426 0.1048 0.0216 -0.1014 -0.2642 -0.2827 -0.2755 0.4289 -0.0576 -0.2202 -0.2587 0.0915 -0.0029 -0.1822 -0.2434 0.2755 -0.1167 -0.2506 0.2898 -0.1881 -0.2586 -0.1296 -0.1218 -0.2071 0.1203 0.0969 0.0945 0.0880 0.0951 0.1032 0.0964 0.0932 0.1139 0.0753 0.1015 0.0984 0.0957 0.0991 0.0897 0.1292 0.1149 0.1428 0.1468 0.1618 0.1490 0.1517 0.1476 0.1629 0.1613 0.1614
va: 2.1190 1.9881 2.0692 3.7089 3.7492 3.8510 3.9074 3.9000 3.8471 4.0731 3.7669 3.9182 3.9398 3.8037 3.6098 3.8922 3.9752 3.7169 3.8781 4.0236 3.7474 3.8995 4.0036 3.8534 3.8816 3.9398 0.9994 1.0291 1.0020 1.0053 1.0017 0.9991 1.0009 1.0136 0.9998 1.0102 0.9993 0.9970 0.9970 0.9959 1.0140 0.9930 1.0107 1.0170 1.0042 0.9873 1.0052 0.9939 1.0079 0.9877 0.9872 0.9900
dispcorr: -0.026657605 hartree
energy: -1117.879816865964
dipole: -20.63042 19.30364 -1.32678 -12.97364 13.30739 0.33376 13.53710 -13.16573 0.37136
magnitude: 1.41762 au
magnitude: 3.60330 debye
