program: Orca
programVersion: 5.0.2
elementType: O O O C C C C C C C C C C C C C C C C C C C C C C C H H H H H H H H H H H H H H H H H H H H H H H H H H
charge: 0
multiplicity: 1
keywords: wb97x-d3
keywords: def2-TZVPP
keywords: def2/J RIJCOSX
keywords: DEFGRID2
keywords: scfconv7
keywords: smallprint printgap noloewdin
keywords: NOSOSCF
formula: C23H26O3
InChI: InChI=1/C23H26O3/c1-16(2)13-20-21(23(20,3)4)22(24)25-15-17-9-8-12-19(14-17)26-18-10-6-5-7-11-18/h5-14,20-21H,15H2,1-4H3
52 atoms
O  -2.022921 2.141029 0.417354
O  -2.817241 0.949679 -1.298537
O  3.124902 1.098892 0.777991
C  -4.706801 -0.404015 0.75098
C  -3.423372 -1.145006 0.880131
C  -3.429885 0.388925 0.951847
C  -5.623363 -0.407812 1.952713
C  -5.463094 -0.376713 -0.554417
C  -2.789268 -1.865271 -0.252533
C  -2.760033 1.155957 -0.107386
C  -1.473867 -2.052881 -0.383964
C  -0.894594 -2.798129 -1.545973
C  -0.466979 -1.511843 0.580922
C  -1.193827 2.907075 -0.469234
C  0.049996 2.150902 -0.843459
C  1.029281 1.927099 0.119518
C  0.227233 1.650988 -2.128474
C  2.180002 1.224508 -0.206922
C  1.382504 0.950011 -2.444857
C  2.367631 0.733627 -1.493822
C  3.940014 -0.00718 0.812312
C  5.292616 0.203098 1.033159
C  3.430968 -1.294596 0.696034
C  6.14337 -0.888936 1.140881
C  4.293813 -2.375801 0.794348
C  5.650636 -2.180272 1.016611
H  -3.242175 -1.587216 1.856228
H  -3.28997 0.798364 1.945232
H  -5.066074 -0.419075 2.889917
H  -6.268114 -1.288494 1.938587
H  -6.266322 0.47417 1.956464
H  -6.202376 -1.179751 -0.555161
H  -4.841594 -0.508171 -1.435062
H  -6.005264 0.563951 -0.665495
H  -3.448835 -2.276832 -1.010622
H  -1.661644 -3.154281 -2.232899
H  -0.311597 -3.659303 -1.210563
H  -0.20617 -2.159505 -2.106186
H  -0.909447 -1.002095 1.433879
H  0.194231 -0.804052 0.075964
H  0.171878 -2.312049 0.962156
H  -0.943445 3.801765 0.098286
H  -1.751677 3.215632 -1.353955
H  0.905348 2.309682 1.126164
H  -0.528842 1.817114 -2.884451
H  1.525316 0.571601 -3.448353
H  3.268438 0.197286 -1.762736
H  5.675481 1.211353 1.125344
H  2.37344 -1.459028 0.535872
H  7.198149 -0.724025 1.315109
H  3.896878 -3.378107 0.702472
H  6.317185 -3.028458 1.095073
elementType: O C H
totalener: -1117.85290848 hartree
nucrepener: 2314.01958377 hartree
electener: -3431.87249225 hartree
oneelecener: -6118.16310315 hartree
twoeener: 2686.29061090 hartree
cpcmener: -0.03070284 hartree
kineticenergy: 1112.81744977 hartree
xcener: -110.233155376017 hartree
chargesum: -0.0000000
charge: -0.295405 -0.494283 -0.339993 0.137202 -0.008972 -0.116251 -0.265860 -0.297671 -0.282170 0.407055 -0.002635 -0.228962 -0.239367 0.088807 0.009419 -0.285762 -0.179445 0.290009 -0.171937 -0.167846 0.187679 -0.195586 -0.119429 -0.156110 -0.214865 -0.150021 0.114719 0.095164 0.087871 0.094322 0.095508 0.098507 0.091008 0.103362 0.124399 0.091576 0.098157 0.090806 0.104096 0.030961 0.113094 0.126223 0.115968 0.131396 0.141971 0.161418 0.155329 0.148176 0.198691 0.160404 0.157914 0.161358
qa: -0.2954 -0.4943 -0.3400 0.1372 -0.0090 -0.1163 -0.2659 -0.2977 -0.2822 0.4071 -0.0026 -0.2290 -0.2394 0.0888 0.0094 -0.2858 -0.1794 0.2900 -0.1719 -0.1678 0.1877 -0.1956 -0.1194 -0.1561 -0.2149 -0.1500 0.1147 0.0952 0.0879 0.0943 0.0955 0.0985 0.0910 0.1034 0.1244 0.0916 0.0982 0.0908 0.1041 0.0310 0.1131 0.1262 0.1160 0.1314 0.1420 0.1614 0.1553 0.1482 0.1987 0.1604 0.1579 0.1614
va: 2.1077 1.9921 2.0640 3.7386 3.8049 3.8290 3.9014 3.8909 3.8441 4.1043 3.6350 3.9260 3.9510 3.7999 3.6116 4.0046 3.8897 3.6971 3.9062 3.8586 3.7604 3.9614 3.8033 3.9000 3.9716 3.8662 1.0058 1.0305 1.0043 1.0022 1.0022 0.9988 1.0162 0.9999 0.9999 1.0077 0.9970 0.9962 1.0114 1.0194 1.0006 0.9954 1.0088 1.0230 1.0127 0.9910 0.9968 1.0060 0.9468 0.9888 0.9949 0.9892
dispcorr: -0.028616205 hartree
energy: -1117.881524686587
dipole: -18.11537 18.50930 0.39393 -13.38093 12.94147 -0.43946 0.20324 0.39678 0.60003
magnitude: 0.84163 au
magnitude: 2.13924 debye
