program: Orca
programVersion: 5.0.2
elementType: O O O C C C C C C C C C C C C C C C C C C C C C C C H H H H H H H H H H H H H H H H H H H H H H H H H H
charge: 0
multiplicity: 1
keywords: wb97x-d3
keywords: def2-TZVPP
keywords: def2/J RIJCOSX
keywords: DEFGRID2
keywords: scfconv7
keywords: smallprint printgap noloewdin
keywords: NOSOSCF
formula: C23H26O3
InChI: InChI=1/C23H26O3/c1-16(2)13-20-21(23(20,3)4)22(24)25-15-17-9-8-12-19(14-17)26-18-10-6-5-7-11-18/h5-14,20-21H,15H2,1-4H3
52 atoms
O  -1.187606 -0.957768 1.746533
O  -2.596696 0.777164 1.741714
O  3.046338 0.486529 -1.10866
C  -4.549114 -0.987332 0.128664
C  -3.560466 -0.519572 -0.881292
C  -3.075837 -1.168178 0.428238
C  -5.280595 -2.274455 -0.175507
C  -5.405313 -0.007236 0.89264
C  -3.319812 0.914043 -1.171528
C  -2.311205 -0.337639 1.367615
C  -2.186713 1.381949 -1.702011
C  -2.011053 2.831814 -2.027693
C  -1.022191 0.48892 -2.019696
C  -0.223614 -0.197437 2.491088
C  0.547453 0.713155 1.577976
C  1.468781 0.157932 0.694431
C  0.32656 2.085855 1.570847
C  2.170321 0.978502 -0.176524
C  1.027182 2.895209 0.687596
C  1.953891 2.349869 -0.186635
C  3.863054 -0.576428 -0.81814
C  4.460283 -0.745695 0.425217
C  4.129679 -1.456315 -1.857949
C  5.321927 -1.815923 0.620412
C  5.003841 -2.51346 -1.65121
C  5.599822 -2.702058 -0.411715
H  -3.411274 -1.18305 -1.729401
H  -2.697808 -2.177871 0.321105
H  -4.652547 -2.983488 -0.716107
H  -6.162112 -2.0762 -0.788129
H  -5.616469 -2.758609 0.743288
H  -5.666156 -0.411677 1.872039
H  -6.337597 0.154383 0.348134
H  -4.946763 0.96436 1.047107
H  -4.126764 1.611016 -0.967232
H  -2.903425 3.416832 -1.806355
H  -1.768363 2.969623 -3.084645
H  -1.176114 3.256078 -1.463104
H  -1.182807 -0.046716 -2.959265
H  -0.851526 -0.265921 -1.251401
H  -0.102043 1.061137 -2.137129
H  0.431587 -0.945041 2.935414
H  -0.700213 0.356488 3.300299
H  1.630139 -0.913801 0.692727
H  -0.386073 2.524773 2.256598
H  0.855725 3.963471 0.681843
H  2.50206 2.980125 -0.875154
H  4.26543 -0.056055 1.236458
H  3.660303 -1.309211 -2.822443
H  5.784348 -1.949383 1.589609
H  5.213689 -3.194695 -2.465278
H  6.276692 -3.530384 -0.251512
elementType: O C H
totalener: -1117.85145953 hartree
nucrepener: 2314.10575616 hartree
electener: -3431.95721569 hartree
oneelecener: -6118.51176774 hartree
twoeener: 2686.55455205 hartree
cpcmener: -0.03006850 hartree
kineticenergy: 1112.81150868 hartree
xcener: -110.230927975676 hartree
chargesum: 0.0000000
charge: -0.297021 -0.491185 -0.344171 0.135854 -0.026970 -0.093222 -0.266424 -0.298543 -0.277310 0.390492 -0.001859 -0.215419 -0.317233 0.088760 0.049383 -0.266934 -0.204455 0.315404 -0.140663 -0.253247 0.309441 -0.209920 -0.267996 -0.145539 -0.117355 -0.195021 0.116126 0.095691 0.088130 0.094972 0.095848 0.102707 0.098759 0.091315 0.125854 0.088383 0.103755 0.090014 0.124042 0.097559 0.102462 0.126896 0.114886 0.142668 0.142566 0.161096 0.147063 0.157340 0.147672 0.162881 0.161493 0.160975
qa: -0.2970 -0.4912 -0.3442 0.1359 -0.0270 -0.0932 -0.2664 -0.2985 -0.2773 0.3905 -0.0019 -0.2154 -0.3172 0.0888 0.0494 -0.2669 -0.2045 0.3154 -0.1407 -0.2532 0.3094 -0.2099 -0.2680 -0.1455 -0.1174 -0.1950 0.1161 0.0957 0.0881 0.0950 0.0958 0.1027 0.0988 0.0913 0.1259 0.0884 0.1038 0.0900 0.1240 0.0976 0.1025 0.1269 0.1149 0.1427 0.1426 0.1611 0.1471 0.1573 0.1477 0.1629 0.1615 0.1610
va: 2.1022 1.9927 2.0417 3.7592 3.7999 3.8335 3.8979 3.8880 3.8143 4.1207 3.6594 3.9139 3.9676 3.8098 3.5546 3.9237 3.8999 3.6014 3.8565 3.9693 3.6682 3.9091 4.0130 3.8839 3.8754 3.9046 1.0028 1.0319 1.0043 1.0021 1.0023 1.0000 0.9987 1.0179 1.0004 1.0089 0.9939 0.9950 0.9989 0.9968 0.9982 0.9949 1.0099 1.0120 1.0142 0.9888 1.0059 0.9985 1.0090 0.9890 0.9880 0.9898
dispcorr: -0.028370590 hartree
energy: -1117.879830117749
dipole: -20.79161 21.29436 0.50274 -0.38623 -0.64655 -1.03278 -6.24219 6.11487 -0.12732
magnitude: 1.15568 au
magnitude: 2.93751 debye
