program: Orca
programVersion: 5.0.2
elementType: O O O C C C C C C C C C C C C C C C C C C C C C C C H H H H H H H H H H H H H H H H H H H H H H H H H H
charge: 0
multiplicity: 1
keywords: wb97x-d3
keywords: def2-TZVPP
keywords: def2/J RIJCOSX
keywords: DEFGRID2
keywords: scfconv7
keywords: smallprint printgap noloewdin
keywords: NOSOSCF
formula: C23H26O3
InChI: InChI=1/C23H26O3/c1-16(2)13-20-21(23(20,3)4)22(24)25-15-17-9-8-12-19(14-17)26-18-10-6-5-7-11-18/h5-14,20-21H,15H2,1-4H3
52 atoms
O  -2.009611 1.381783 -1.773611
O  -1.0142 -0.578657 -1.378698
O  3.323854 0.906498 0.172227
C  -3.687366 -1.552176 -0.19795
C  -3.098826 -0.728668 0.893615
C  -3.213569 -0.153495 -0.53118
C  -5.190652 -1.710996 -0.19282
C  -2.983169 -2.781217 -0.71951
C  -1.787611 -1.009824 1.525006
C  -1.975187 0.14732 -1.259829
C  -1.135423 -0.117256 2.277092
C  0.139238 -0.455126 2.984631
C  -1.6574 1.275366 2.490127
C  -0.793542 1.903229 -2.334491
C  0.194361 2.203328 -1.243416
C  1.337371 1.428743 -1.098187
C  -0.069964 3.222869 -0.332888
C  2.181346 1.641293 -0.016768
C  0.79769 3.448376 0.724281
C  1.918338 2.648576 0.900038
C  3.337099 -0.445612 -0.060468
C  4.553495 -0.992222 -0.448346
C  2.225936 -1.258985 0.130354
C  4.657198 -2.361969 -0.643094
C  2.342925 -2.6259 -0.079228
C  3.553423 -3.185212 -0.465431
H  -3.820971 -0.264875 1.560515
H  -3.99258 0.58924 -0.65612
H  -5.484829 -2.535707 0.458896
H  -5.56311 -1.929759 -1.195244
H  -5.695148 -0.811302 0.161316
H  -1.902141 -2.757215 -0.624085
H  -3.220368 -2.938757 -1.772927
H  -3.339739 -3.655483 -0.1718
H  -1.366619 -2.003379 1.406509
H  0.029361 -0.319688 4.064129
H  0.948161 0.211584 2.674079
H  0.45533 -1.482216 2.8035
H  -2.460374 1.286864 3.232661
H  -2.061181 1.710694 1.574653
H  -0.876331 1.940971 2.858114
H  -1.099946 2.812424 -2.848952
H  -0.381422 1.217729 -3.0762
H  1.549914 0.648341 -1.817989
H  -0.953918 3.837774 -0.448817
H  0.594279 4.242095 1.430787
H  2.585995 2.808148 1.737065
H  5.413219 -0.349548 -0.589943
H  1.27452 -0.845602 0.43707
H  5.607807 -2.783496 -0.942494
H  1.474528 -3.255269 0.066881
H  3.636025 -4.251915 -0.624769
elementType: O C H
totalener: -1117.85118079 hartree
nucrepener: 2397.64709506 hartree
electener: -3515.49827584 hartree
oneelecener: -6285.92329082 hartree
twoeener: 2770.42501498 hartree
cpcmener: -0.02913251 hartree
kineticenergy: 1112.80496119 hartree
xcener: -110.231031979148 hartree
chargesum: 0.0000000
charge: -0.295912 -0.493779 -0.341143 0.132612 -0.024439 -0.092981 -0.265660 -0.294407 -0.266326 0.395495 -0.008199 -0.232149 -0.319541 0.087150 0.027270 -0.190037 -0.265615 0.303438 -0.111483 -0.270670 0.315435 -0.246915 -0.167545 -0.135955 -0.178119 -0.175042 0.115048 0.093816 0.095442 0.095938 0.088214 0.087951 0.103582 0.098715 0.130632 0.115587 0.090334 0.090225 0.124719 0.100946 0.100141 0.129250 0.115746 0.142067 0.145131 0.162435 0.148981 0.146966 0.111154 0.160535 0.160044 0.160920
qa: -0.2959 -0.4938 -0.3411 0.1326 -0.0244 -0.0930 -0.2657 -0.2944 -0.2663 0.3955 -0.0082 -0.2321 -0.3195 0.0872 0.0273 -0.1900 -0.2656 0.3034 -0.1115 -0.2707 0.3154 -0.2469 -0.1675 -0.1360 -0.1781 -0.1750 0.1150 0.0938 0.0954 0.0959 0.0882 0.0880 0.1036 0.0987 0.1306 0.1156 0.0903 0.0902 0.1247 0.1009 0.1001 0.1292 0.1157 0.1421 0.1451 0.1624 0.1490 0.1470 0.1112 0.1605 0.1600 0.1609
va: 2.1059 1.9880 2.0728 3.7809 3.7772 3.8400 3.8953 3.8982 3.7862 4.1080 3.6421 3.9066 3.9524 3.8104 3.5486 3.8918 3.9034 3.6670 3.8009 3.9650 3.6685 3.9836 3.8685 3.8918 3.9314 3.8955 1.0012 1.0319 1.0020 1.0024 1.0044 1.0148 0.9997 0.9994 0.9996 0.9983 0.9900 1.0073 0.9986 0.9961 1.0021 0.9931 1.0088 1.0144 1.0067 0.9867 1.0060 1.0084 1.0021 0.9880 0.9928 0.9893
dispcorr: -0.031197118 hartree
energy: -1117.882377904177
dipole: -17.89434 16.66221 -1.23213 -8.36499 8.91432 0.54933 9.76870 -9.43779 0.33091
magnitude: 1.38903 au
magnitude: 3.53063 debye
