program: Orca
programVersion: 5.0.2
elementType: O O O C C C C C C C C C C C C C C C C C C C C C C C H H H H H H H H H H H H H H H H H H H H H H H H H H
charge: 0
multiplicity: 1
keywords: wb97x-d3
keywords: def2-TZVPP
keywords: def2/J RIJCOSX
keywords: DEFGRID2
keywords: scfconv7
keywords: smallprint printgap noloewdin
keywords: NOSOSCF
formula: C23H26O3
InChI: InChI=1/C23H26O3/c1-16(2)13-20-21(23(20,3)4)22(24)25-15-17-9-8-12-19(14-17)26-18-10-6-5-7-11-18/h5-14,20-21H,15H2,1-4H3
52 atoms
O  -1.733928 2.048746 -0.201661
O  -1.628433 0.316888 -1.608731
O  3.259125 1.606764 0.390428
C  -3.570469 -0.927406 0.579017
C  -2.210105 -1.48208 0.87419
C  -2.383463 0.016899 0.661291
C  -4.545261 -0.832587 1.726952
C  -4.234018 -1.222302 -0.742299
C  -1.492538 -2.381008 -0.052701
C  -1.881228 0.753816 -0.512086
C  -1.049372 -3.594518 0.291922
C  -0.33478 -4.464851 -0.695443
C  -1.205163 -4.170826 1.673961
C  -1.224764 2.9311 -1.190351
C  0.277627 2.907129 -1.289807
C  1.066506 2.220404 -0.378854
C  0.884651 3.642697 -2.30604
C  2.451466 2.25425 -0.503427
C  2.265166 3.691507 -2.400053
C  3.061854 2.988615 -1.506092
C  2.925744 0.342003 0.79562
C  2.49703 -0.624174 -0.107175
C  3.079242 0.037137 2.140202
C  2.219472 -1.903017 0.350653
C  2.804549 -1.249766 2.582994
C  2.369142 -2.222583 1.694125
H  -2.04528 -1.709981 1.922356
H  -2.343541 0.602875 1.572137
H  -5.277508 -0.039936 1.558615
H  -4.042083 -0.625339 2.672415
H  -5.093221 -1.770318 1.842607
H  -4.934302 -0.428138 -1.008811
H  -4.806719 -2.14852 -0.6612
H  -3.540317 -1.343856 -1.570129
H  -1.329431 -2.047633 -1.069603
H  0.653197 -4.753641 -0.324716
H  -0.204067 -3.975855 -1.660991
H  -0.881429 -5.397469 -0.862599
H  -2.210575 -4.037072 2.075012
H  -0.51261 -3.707514 2.382153
H  -0.994006 -5.240569 1.680492
H  -1.5567 3.922865 -0.879837
H  -1.674174 2.731624 -2.165778
H  0.621511 1.663331 0.436256
H  0.274683 4.181794 -3.02131
H  2.731227 4.267641 -3.188964
H  4.141319 3.010562 -1.58569
H  2.384968 -0.38955 -1.158425
H  3.413513 0.800129 2.832141
H  1.893244 -2.656194 -0.354314
H  2.92567 -1.486873 3.632197
H  2.15426 -3.22443 2.042865
elementType: O C H
totalener: -1117.86551815 hartree
nucrepener: 2339.08461975 hartree
electener: -3456.95013790 hartree
oneelecener: -6168.19004539 hartree
twoeener: 2711.23990749 hartree
cpcmener: -0.02547623 hartree
kineticenergy: 1112.79923873 hartree
xcener: -110.229728148301 hartree
chargesum: 0.0000000
charge: -0.297250 -0.463387 -0.333301 0.123604 0.043776 -0.109838 -0.264195 -0.281686 -0.325403 0.384198 -0.019727 -0.247618 -0.287778 0.085054 0.021009 -0.176904 -0.238572 0.232913 -0.120096 -0.236473 0.277001 -0.181128 -0.249868 -0.162837 -0.109905 -0.200135 0.113928 0.097724 0.094192 0.087038 0.093784 0.102666 0.098087 0.093986 0.127447 0.093508 0.093366 0.108488 0.105699 0.096278 0.098208 0.129605 0.115822 0.148271 0.142297 0.156346 0.146146 0.152277 0.144648 0.182656 0.156927 0.159155
qa: -0.2973 -0.4634 -0.3333 0.1236 0.0438 -0.1098 -0.2642 -0.2817 -0.3254 0.3842 -0.0197 -0.2476 -0.2878 0.0851 0.0210 -0.1769 -0.2386 0.2329 -0.1201 -0.2365 0.2770 -0.1811 -0.2499 -0.1628 -0.1099 -0.2001 0.1139 0.0977 0.0942 0.0870 0.0938 0.1027 0.0981 0.0940 0.1274 0.0935 0.0934 0.1085 0.1057 0.0963 0.0982 0.1296 0.1158 0.1483 0.1423 0.1563 0.1461 0.1523 0.1446 0.1827 0.1569 0.1592
va: 2.1163 2.0254 2.0699 3.7520 3.7137 3.9091 3.9074 3.9107 3.8198 4.0948 3.6679 3.9217 3.9418 3.8233 3.6456 3.8942 3.9801 3.7707 3.8950 4.0052 3.6946 3.9011 4.0208 3.8434 3.8960 3.8919 0.9988 1.0285 1.0025 1.0056 1.0021 1.0004 1.0013 1.0140 1.0243 0.9903 1.0066 0.9970 0.9975 0.9979 1.0034 0.9901 1.0144 1.0096 1.0002 0.9892 1.0059 1.0026 1.0082 0.9719 0.9891 0.9892
dispcorr: -0.027685832 hartree
energy: -1117.893203985921
dipole: -18.94666 18.05656 -0.89010 -22.27535 22.17772 -0.09762 4.60879 -3.84917 0.75963
magnitude: 1.17424 au
magnitude: 2.98468 debye
