program: Orca
programVersion: 5.0.2
elementType: O O O C C C C C C C C C C C C C C C C C C C C C C C H H H H H H H H H H H H H H H H H H H H H H H H H H
charge: 0
multiplicity: 1
keywords: wb97x-d3
keywords: def2-TZVPP
keywords: def2/J RIJCOSX
keywords: DEFGRID2
keywords: scfconv7
keywords: smallprint printgap noloewdin
keywords: NOSOSCF
formula: C23H26O3
InChI: InChI=1/C23H26O3/c1-16(2)13-20-21(23(20,3)4)22(24)25-15-17-9-8-12-19(14-17)26-18-10-6-5-7-11-18/h5-14,20-21H,15H2,1-4H3
52 atoms
O  -1.470711 2.108427 0.859363
O  -2.113456 1.139171 -1.042446
O  3.395289 1.064302 -0.332488
C  -3.528516 -0.934091 0.818932
C  -2.143732 -1.487974 0.681576
C  -2.343477 -0.018702 1.057097
C  -4.299331 -1.31186 2.061536
C  -4.41018 -0.788188 -0.396098
C  -1.575277 -1.919794 -0.612213
C  -1.983614 1.092265 0.157721
C  -1.111922 -3.145896 -0.88301
C  -0.555745 -3.470446 -2.236876
C  -1.099266 -4.293788 0.079545
C  -0.992049 3.236936 0.127984
C  0.247933 2.920446 -0.661278
C  1.242357 2.126244 -0.100461
C  0.416715 3.439244 -1.938973
C  2.381351 1.828856 -0.835687
C  1.577683 3.166924 -2.64862
C  2.559949 2.35098 -2.11022
C  3.123588 0.010804 0.498137
C  3.988835 -0.191232 1.564532
C  2.067275 -0.86388 0.26806
C  3.795273 -1.277804 2.406365
C  1.878249 -1.936593 1.126729
C  2.736274 -2.150077 2.197352
H  -1.812411 -2.069812 1.535038
H  -2.142083 0.200059 2.099214
H  -3.647058 -1.430479 2.927865
H  -4.826853 -2.256395 1.912566
H  -5.043944 -0.551649 2.307289
H  -5.127799 0.023429 -0.260512
H  -4.981719 -1.708244 -0.53527
H  -3.869847 -0.602178 -1.319589
H  -1.545283 -1.190704 -1.413135
H  -0.605133 -2.621781 -2.919147
H  -1.095227 -4.303691 -2.695396
H  0.489775 -3.783475 -2.165044
H  -0.097257 -4.723322 0.159397
H  -1.746196 -5.098113 -0.28218
H  -1.433304 -4.03653 1.082924
H  -0.778521 3.985101 0.892214
H  -1.772556 3.641726 -0.519833
H  1.124937 1.736029 0.903359
H  -0.359718 4.050781 -2.381885
H  1.710081 3.57335 -3.643003
H  3.456217 2.11798 -2.671335
H  4.809343 0.495876 1.73019
H  1.394323 -0.717977 -0.568214
H  4.47345 -1.433879 3.235472
H  1.05228 -2.612935 0.948834
H  2.580914 -2.991032 2.860271
elementType: O C H
totalener: -1117.86693041 hartree
nucrepener: 2347.00815132 hartree
electener: -3464.87508173 hartree
oneelecener: -6183.86522584 hartree
twoeener: 2718.99014411 hartree
cpcmener: -0.02440309 hartree
kineticenergy: 1112.79666868 hartree
xcener: -110.229325179196 hartree
chargesum: -0.0000000
charge: -0.296047 -0.465173 -0.331117 0.135297 0.013604 -0.096115 -0.263951 -0.287438 -0.343363 0.387519 -0.016931 -0.231451 -0.265252 0.103337 0.041881 -0.247829 -0.233797 0.288546 -0.106730 -0.262715 0.315511 -0.267724 -0.252870 -0.090411 -0.054719 -0.257891 0.111377 0.097042 0.086996 0.093454 0.094868 0.102406 0.095415 0.097708 0.130601 0.090466 0.097901 0.092256 0.092128 0.113052 0.094190 0.120678 0.113485 0.139334 0.140995 0.156849 0.145581 0.145258 0.156097 0.156499 0.168495 0.152703
qa: -0.2960 -0.4652 -0.3311 0.1353 0.0136 -0.0961 -0.2640 -0.2874 -0.3434 0.3875 -0.0169 -0.2315 -0.2653 0.1033 0.0419 -0.2478 -0.2338 0.2885 -0.1067 -0.2627 0.3155 -0.2677 -0.2529 -0.0904 -0.0547 -0.2579 0.1114 0.0970 0.0870 0.0935 0.0949 0.1024 0.0954 0.0977 0.1306 0.0905 0.0979 0.0923 0.0921 0.1131 0.0942 0.1207 0.1135 0.1393 0.1410 0.1568 0.1456 0.1453 0.1561 0.1565 0.1685 0.1527
va: 2.1130 2.0257 2.0849 3.7581 3.7233 3.9181 3.9048 3.9064 3.8085 4.0916 3.7138 3.9218 3.9248 3.8064 3.6149 3.9229 3.9766 3.7172 3.8892 4.0171 3.7145 4.0254 3.9411 3.8588 3.7585 3.9994 1.0040 1.0285 1.0052 1.0023 1.0023 1.0003 1.0017 1.0146 1.0217 1.0080 0.9974 0.9962 0.9958 0.9970 1.0103 0.9923 1.0094 1.0185 1.0035 0.9889 1.0068 1.0082 0.9996 0.9886 0.9669 0.9968
dispcorr: -0.027717775 hartree
energy: -1117.894648186261
dipole: -18.62262 18.14487 -0.47776 -21.07751 20.61530 -0.46221 1.10540 -0.04078 1.06462
magnitude: 1.25511 au
magnitude: 3.19023 debye
