program: Orca
programVersion: 5.0.2
elementType: O O O C C C C C C C C C C C C C C C C C C C C C C C H H H H H H H H H H H H H H H H H H H H H H H H H H
charge: 0
multiplicity: 1
keywords: wb97x-d3
keywords: def2-TZVPP
keywords: def2/J RIJCOSX
keywords: DEFGRID2
keywords: scfconv7
keywords: smallprint printgap noloewdin
keywords: NOSOSCF
formula: C23H26O3
InChI: InChI=1/C23H26O3/c1-16(2)13-20-21(23(20,3)4)22(24)25-15-17-9-8-12-19(14-17)26-18-10-6-5-7-11-18/h5-14,20-21H,15H2,1-4H3
52 atoms
O  -1.148677 -0.04166 2.026254
O  -2.758379 1.229439 1.135119
O  3.594031 0.863732 -0.334056
C  -4.130973 -1.421718 0.279393
C  -3.097819 -1.177385 -0.764413
C  -2.711845 -1.132715 0.723843
C  -4.567198 -2.853658 0.489207
C  -5.252571 -0.436836 0.502021
C  -3.083347 0.036816 -1.613704
C  -2.25542 0.14348 1.297376
C  -1.986246 0.503485 -2.215664
C  -2.025954 1.715825 -3.091587
C  -0.642025 -0.142545 -2.023752
C  -0.431885 1.116293 2.478332
C  0.43362 1.652051 1.37259
C  1.615009 0.984705 1.056801
C  0.050831 2.765911 0.633265
C  2.394142 1.424381 -0.004768
C  0.84291 3.201913 -0.419984
C  2.007693 2.529927 -0.752183
C  3.831812 -0.473402 -0.180801
C  2.886471 -1.445171 -0.487033
C  5.107003 -0.833856 0.233159
C  3.228954 -2.784292 -0.363408
C  5.438754 -2.176494 0.338708
C  4.501198 -3.1578 0.047704
H  -2.70325 -2.067317 -1.249742
H  -2.15208 -1.992716 1.072944
H  -5.384022 -3.109169 -0.188996
H  -4.922424 -3.010434 1.509845
H  -3.754778 -3.558949 0.307874
H  -4.986325 0.595859 0.297685
H  -5.609516 -0.488113 1.532473
H  -6.093063 -0.693698 -0.146313
H  -4.025833 0.552322 -1.770567
H  -1.652023 1.490552 -4.094032
H  -1.380826 2.504271 -2.693068
H  -3.032733 2.12224 -3.189913
H  0.129522 0.347596 -2.617218
H  -0.652346 -1.197022 -2.310168
H  -0.325422 -0.105376 -0.978312
H  0.175473 0.759452 3.3094
H  -1.11257 1.877617 2.860965
H  1.921688 0.131759 1.651407
H  -0.859456 3.296045 0.880135
H  0.548236 4.07093 -0.993863
H  2.62341 2.864992 -1.577503
H  1.893831 -1.171224 -0.822301
H  5.835788 -0.065843 0.460635
H  2.490908 -3.540546 -0.597851
H  6.436253 -2.453006 0.655259
H  4.760514 -4.204429 0.137524
elementType: O C H
totalener: -1117.86477200 hartree
nucrepener: 2332.99464609 hartree
electener: -3450.85941809 hartree
oneelecener: -6155.70141528 hartree
twoeener: 2704.84199720 hartree
cpcmener: -0.02478932 hartree
kineticenergy: 1112.79596783 hartree
xcener: -110.226213618742 hartree
chargesum: 0.0000000
charge: -0.289695 -0.461844 -0.326041 0.136040 -0.032716 -0.098204 -0.263029 -0.296243 -0.263539 0.380674 -0.010840 -0.219761 -0.273591 0.068821 0.007889 -0.230778 -0.183402 0.309335 -0.140624 -0.250676 0.247906 -0.146578 -0.225246 -0.190173 -0.137598 -0.164784 0.110415 0.090481 0.093939 0.095428 0.085235 0.093388 0.099452 0.098178 0.121205 0.100096 0.092667 0.087439 0.107236 0.117185 0.064256 0.121900 0.113496 0.138396 0.138463 0.157570 0.143886 0.171327 0.144337 0.154658 0.156759 0.157303
qa: -0.2897 -0.4618 -0.3260 0.1360 -0.0327 -0.0982 -0.2630 -0.2962 -0.2635 0.3807 -0.0108 -0.2198 -0.2736 0.0688 0.0079 -0.2308 -0.1834 0.3093 -0.1406 -0.2507 0.2479 -0.1466 -0.2252 -0.1902 -0.1376 -0.1648 0.1104 0.0905 0.0939 0.0954 0.0852 0.0934 0.0995 0.0982 0.1212 0.1001 0.0927 0.0874 0.1072 0.1172 0.0643 0.1219 0.1135 0.1384 0.1385 0.1576 0.1439 0.1713 0.1443 0.1547 0.1568 0.1573
va: 2.1046 2.0262 2.0853 3.7594 3.8183 3.8283 3.8972 3.8915 3.8118 4.1336 3.6924 3.9154 3.9354 3.8366 3.5958 3.9313 3.8725 3.6785 3.8793 3.9565 3.7265 3.8576 3.9838 3.9506 3.8965 3.8865 1.0067 1.0331 1.0025 1.0028 1.0048 1.0181 1.0008 0.9984 1.0004 0.9946 0.9947 1.0089 1.0003 1.0017 1.0008 0.9956 1.0112 1.0097 1.0172 0.9898 1.0079 0.9655 1.0086 0.9941 0.9896 0.9907
dispcorr: -0.028868064 hartree
energy: -1117.893640062121
dipole: -20.40562 20.72879 0.32317 -6.72947 5.65079 -1.07868 -8.47160 8.48498 0.01338
magnitude: 1.12613 au
magnitude: 2.86240 debye
