program: Orca
programVersion: 5.0.2
elementType: O O O C C C C C C C C C C C C C C C C C C C C C C C H H H H H H H H H H H H H H H H H H H H H H H H H H
charge: 0
multiplicity: 1
keywords: wb97x-d3
keywords: def2-TZVPP
keywords: def2/J RIJCOSX
keywords: DEFGRID2
keywords: scfconv7
keywords: smallprint printgap noloewdin
keywords: NOSOSCF
formula: C23H26O3
InChI: InChI=1/C23H26O3/c1-16(2)13-20-21(23(20,3)4)22(24)25-15-17-9-8-12-19(14-17)26-18-10-6-5-7-11-18/h5-14,20-21H,15H2,1-4H3
52 atoms
O  -0.820201 1.231737 1.8997
O  -2.258892 1.77263 0.286004
O  2.962461 0.003414 -1.430843
C  -4.011707 -0.553605 1.356075
C  -3.031431 -1.278903 0.486753
C  -2.533953 -0.270539 1.527877
C  -4.635099 -1.340405 2.485847
C  -4.95514 0.464399 0.763463
C  -2.898715 -1.044568 -0.964835
C  -1.899879 1.003795 1.145585
C  -2.906234 -1.992374 -1.909355
C  -2.731079 -1.630471 -3.35414
C  -3.075461 -3.46006 -1.657857
C  -0.058675 2.406759 1.615371
C  0.701134 2.301261 0.322022
C  1.483025 1.178096 0.069788
C  0.643076 3.326032 -0.614367
C  2.209774 1.097684 -1.110021
C  1.371666 3.23207 -1.791796
C  2.1602 2.121993 -2.046541
C  3.647049 -0.667278 -0.453535
C  4.408286 0.001429 0.497911
C  3.603454 -2.053488 -0.479682
C  5.12092 -0.733879 1.433411
C  4.331991 -2.776543 0.454774
C  5.086364 -2.122335 1.41853
H  -2.830508 -2.297973 0.798584
H  -2.077924 -0.726339 2.399027
H  -3.946838 -2.078519 2.900441
H  -5.522974 -1.873436 2.139482
H  -4.941968 -0.679397 3.299315
H  -5.210122 1.230765 1.498012
H  -5.883632 -0.034524 0.478243
H  -4.572507 0.965534 -0.120436
H  -2.778814 -0.019179 -1.293955
H  -2.5773 -0.560799 -3.496857
H  -3.6023 -1.927718 -3.944269
H  -1.873875 -2.153343 -3.787637
H  -3.323957 -3.708133 -0.627786
H  -2.166153 -4.006969 -1.922391
H  -3.86965 -3.864274 -2.290882
H  0.63086 2.491489 2.455702
H  -0.696524 3.292789 1.620749
H  1.522617 0.371065 0.792219
H  0.024777 4.195003 -0.426789
H  1.324687 4.030311 -2.521264
H  2.731044 2.044743 -2.963397
H  4.450246 1.083505 0.511356
H  3.008641 -2.560543 -1.229191
H  5.712115 -0.213453 2.175963
H  4.300288 -3.858232 0.431008
H  5.64724 -2.689011 2.150084
elementType: O C H
totalener: -1117.86709464 hartree
nucrepener: 2256.31092820 hartree
electener: -3374.17802284 hartree
oneelecener: -6002.79444256 hartree
twoeener: 2628.61641972 hartree
cpcmener: -0.02548154 hartree
kineticenergy: 1112.80141820 hartree
xcener: -110.227128598071 hartree
chargesum: 0.0000000
charge: -0.296570 -0.465284 -0.331927 0.123732 0.028043 -0.112779 -0.263314 -0.286417 -0.305942 0.400468 -0.033579 -0.221369 -0.259536 0.103695 0.025321 -0.222826 -0.215522 0.260497 -0.117122 -0.246415 0.264321 -0.178611 -0.239194 -0.147270 -0.125878 -0.182150 0.110992 0.094909 0.086811 0.094327 0.093416 0.101808 0.094309 0.098687 0.124600 0.088485 0.092597 0.091752 0.088222 0.098817 0.093609 0.122417 0.112212 0.136852 0.141136 0.156464 0.146272 0.155860 0.146819 0.158847 0.157631 0.157777
qa: -0.2966 -0.4653 -0.3319 0.1237 0.0280 -0.1128 -0.2633 -0.2864 -0.3059 0.4005 -0.0336 -0.2214 -0.2595 0.1037 0.0253 -0.2228 -0.2155 0.2605 -0.1171 -0.2464 0.2643 -0.1786 -0.2392 -0.1473 -0.1259 -0.1822 0.1110 0.0949 0.0868 0.0943 0.0934 0.1018 0.0943 0.0987 0.1246 0.0885 0.0926 0.0918 0.0882 0.0988 0.0936 0.1224 0.1122 0.1369 0.1411 0.1565 0.1463 0.1559 0.1468 0.1588 0.1576 0.1578
va: 2.1154 2.0316 2.0699 3.7034 3.7549 3.8949 3.9087 3.9033 3.8672 4.0995 3.7573 3.9258 3.9429 3.8066 3.6355 3.9161 3.9535 3.7341 3.8999 4.0069 3.7139 3.9093 4.0069 3.8940 3.8863 3.9020 1.0056 1.0296 1.0052 1.0021 1.0024 1.0000 1.0017 1.0142 1.0236 1.0090 0.9968 0.9956 1.0107 0.9961 0.9977 0.9916 1.0096 1.0185 1.0046 0.9894 1.0063 0.9970 1.0074 0.9904 0.9894 0.9905
dispcorr: -0.023690874 hartree
energy: -1117.890785513208
dipole: -24.59003 24.80101 0.21098 -12.73052 12.06595 -0.66457 -1.00289 2.06450 1.06161
magnitude: 1.27011 au
magnitude: 3.22837 debye
