program: Gaussian 09
title: 000074995
version: EM64L-G09RevD.01
frameworkgroup: C1[X(C13H10N2O)]
method: RPBEPBE
basis: SDD
operation: Freq
keyword: #p
keyword: freq=noraman
keyword: PBEPBE/SDD
title: #p freq=noraman PBEPBE/SDD
converged: NO YES NO YES
title: Mulliken charges:
elementType: O N N C C C C C C C C C C C C C H H H H H H H H H H
charge: -0.284289 -0.690066 -0.331740 0.408789 0.414591 0.192492 0.178812 -0.470495 -0.397562 -0.574860 -0.368011 -0.481780 0.551484 -0.461060 0.099584 -0.333585 0.257016 0.235698 0.257853 0.231336 0.279748 0.223758 0.225112 0.318467 0.314796 0.203912
chargesum: 0.00000
title: Mulliken charges with hydrogens summed into heavy atoms:
elementType: O N N C C C C C C C C C C C C C
charge: -0.284289 -0.056803 -0.127828 0.408789 0.414591 0.192492 0.178812 -0.213479 -0.161864 -0.317008 -0.136675 -0.202032 0.551484 -0.237301 0.099584 -0.108473
polarizability: 4.19020314e+02 1.89960347e+01 1.60811820e+02 -8.87938625e-03 2.53751095e-03 6.14351860e+01
1716.lowfreq: -0.0012 -0.0010 -0.0003 3.7275 6.5080 7.3985 59.8903 82.9975 171.5477
frequency: 59.8897 82.9909 171.5470 175.6311 193.9954 250.9463 302.9831 303.5252 333.4580 401.4706 404.1437 409.9588 427.1694 435.5634 456.8790 461.9843 475.5933 564.1686 583.2048 614.9790 615.1213 632.7567 702.5607 723.8005 742.2393 743.8281 767.8529 804.3640 829.2193 835.4327 837.9657 858.6245 873.3357 899.7084 901.7691 944.4732 952.9527 965.0954 1038.7566 1083.2880 1106.5328 1138.0865 1160.2928 1177.1427 1196.6422 1243.9255 1259.4016 1294.1584 1334.7482 1349.2398 1386.5334 1402.6789 1433.4908 1464.0218 1498.9482 1523.9323 1549.3051 1568.8171 1598.4051 1622.9924 1646.3346 1665.6534 3109.3010 3124.7584 3131.2966 3136.0561 3147.8671 3156.8723 3181.9266 3284.3149 3561.3829 3701.3901
redmass: 6.3968 4.6173 5.1504 4.5885 4.3806 6.3383 4.9986 4.4615 7.2718 3.6417 1.0766 2.7248 1.9286 1.7759 2.7045 5.0665 4.2747 7.6986 8.3317 4.1344 6.1771 3.3096 7.5818 2.6311 7.1096 2.7203 1.3955 1.4538 4.7956 1.4647 3.9123 1.7209 1.4824 1.4493 3.7862 1.3899 2.8052 1.3343 1.5004 2.4576 2.2178 1.4226 1.2498 2.2300 1.3119 1.4024 1.7122 2.0781 2.2179 3.2473 3.9363 2.6506 5.9796 4.9686 4.2444 4.4938 7.1404 7.8969 6.3766 6.4439 1.2083 7.2792 1.0858 1.0871 1.0922 1.0984 1.0969 1.0926 1.0927 1.0748 1.0452 1.1041
irintensity: 1.4140 6.1562 2.7193 0.1805 0.2753 0.8608 4.7424 2.4677 0.4439 17.6321 23.1154 17.9727 125.8408 147.5174 1.2599 11.4595 22.1559 2.2859 2.3819 2.4184 0.1414 20.3075 1.9056 5.7295 1.3196 1.6478 12.5494 48.3544 8.0011 57.0894 8.3088 52.6490 26.7891 47.8862 0.4621 3.8154 7.1768 0.9403 3.1508 70.5258 101.5244 16.6437 63.7853 2.5529 101.3087 5.4332 11.8510 9.9635 138.5968 22.6963 8.9679 38.7866 47.3686 19.4866 109.8739 18.4883 50.6721 2.8795 19.8735 793.5033 241.3348 130.5581 2.0276 5.9944 7.6588 40.2270 26.8189 7.3222 0.6849 13.3135 191.3592 25.6611
temp: 298.150 k
press: 1.00000 atm
elementType: 8 7 7 6 6 6 6 6 6 6 6 6 6 6 6 6 1 1 1 1 1 1 1 1 1 1
symmnumber: 1
zpe: 520493.2 jmol-1
zpe.correction: 0.198245 hartree
zpe.thermalcorrener: 0.210574 hartree
zpe.thermalcorrenthalpy: 0.211518 hartree
zpe.thermalcorrgfe: 0.160191 hartree
zpe.sumelectzpe: -684.998335 hartree
zpe.sumelectthermal: -684.986006 hartree
zpe.sumelectthermalent: -684.985062 hartree
zpe.sumelectthermalfe: -685.036390 hartree
dipole: 7.2348 3.0068 -0.0002
dipole: 7.8347
quadrupole: -71.6669 -85.1738 -99.6454
quadrupole: -20.6285 -0.0042 0.0021
quadrupole: 13.8285 0.3216 -14.1500 -20.6285 -0.0042 0.0021
hfenergy: -685.1965807 hartree
pointgroup: C01 [X(C13H10N2O1)]
dipole: 2.8556633 1.1603443 -0.0000731 debye
dipolederiv: -1.1193628 -0.1423931 0.0000199 0.1349104 -0.2324367 -0.0000189 0.0000575 0.0000063 -0.172644 -1.8247051 0.5805077 -0.0000274 1.1325591 -0.4693477 0.0000449 -0.0002671 0.0001194 -0.7149408 -1.0658126 -0.3134246 -0.0000535 -0.7464784 -0.3237849 0.0000163 -0.0000422 0.0000259 -0.4999881 -1.1299861 -0.0309986 0.0000151 0.3907296 -0.3736699 -0.0000258 0.0000064 -0.0000171 -0.0274691 -0.7640111 0.0224976 0.0000141 -0.253453 -0.138912 -0.000008 0.0000559 -0.0000095 0.0306681 0.8891289 -0.0117099 0.0000285 -0.3501094 0.4327531 0.0000156 -0.0000041 0.0000002 0.1538681 1.0726156 0.1271423 -0.000056 0.2187017 0.2126507 0.0000051 -0.00015 -0.0000262 0.0907051 1.2790906 -0.0249477 -0.000028 -0.3188429 0.1556032 0.0000183 0.0000021 0.0000235 -0.1364845 1.0929143 0.0760329 -0.0000066 -0.0109333 0.1677742 0.0000091 0.0000016 0.0000148 -0.1191135 -0.8731776 0.2518373 0.0000066 -0.0735742 -0.0030338 0.0000163 -0.0000026 0.0000081 -0.267269 0.5797668 -0.0398155 -0.0000233 -0.075038 0.1317747 0.0000399 -0.0000841 0.0000243 -0.1460205 -0.759154 -0.1220763 0.000019 0.0131917 -0.0237513 0.0000287 0.0000319 0.0000149 -0.2225197 1.6543767 -0.5955174 0.00002 -1.3724188 0.4908736 0.000003 0.0000196 -0.0000061 0.1550268 -0.5249865 0.0067681 0.0000094 1.1718068 -0.2236688 -0.00001 0.0000649 0.0000036 -0.2430006 0.8639797 0.1721448 -0.0000424 0.2862931 0.236977 0.0000087 -0.0000082 0.0000611 0.0604669 -0.0891172 -0.0515264 0.0000152 -0.4175492 -0.1285776 0.0000232 0.0000002 -0.0000208 -0.1072988 0.0720425 -0.0000307 0.0000004 0.0405137 -0.0797179 -0.0000101 -0.0000015 -0.0000189 0.1482939 0.1031149 0.0291953 0.0000015 -0.0438264 -0.0973155 -0.0000115 -0.0000065 -0.0000114 0.1495651 0.0609076 0.005336 -0.0000031 0.0409361 -0.0510567 -0.0000134 -0.0000069 -0.0000085 0.1903236 0.0707316 -0.0379915 0.0000072 0.0725097 -0.1150815 -0.0000223 -0.0000045 -0.0000196 0.142255 0.0725641 0.0153696 0.0000013 0.0323153 -0.0065823 -0.000013 0.0000283 -0.0000034 0.1775623 -0.1470776 -0.080403 -0.0000015 -0.0470183 0.0510708 -0.0000037 -0.0000024 -0.0000054 0.1767851 -0.1108111 0.0923236 0.0000196 0.0199639 0.0315111 -0.0000101 0.0000349 -0.000016 0.1547734 0.1684626 -0.041227 0.0000002 -0.1642279 0.1795677 -0.0000284 0.0000883 -0.0000761 0.3861108 0.3106539 -0.0437938 0.0000147 0.0141145 0.1260036 -0.0000056 0.0001261 -0.0000271 0.3855554 0.1178519 0.1567004 0.0000492 0.3049244 0.0503768 -0.0000483 0.0000625 -0.0000361 0.254789 unknown
polarizability: 419.305311|16.9463732|160.5268232|-0.008859|0.0026078|61.435186 unknown
InChI: InChI=1S/C13H10N2O/c14-10-3-1-8-5-9-2-4-11(15)7-13(9)16-12(8)6-10/h1-7,14H,15H2
charge 0 multiplicity 1
26 atoms
O  0.020662 -1.172354 0.000002
N  4.841147 -1.279802 0.000121
N  -4.772958 -1.389414 0.000356
C  1.231222 0.979745 0.000146
C  -1.232842 0.976646 0.000189
C  1.224329 -0.454385 0.000065
C  -1.224187 -0.485735 0.000131
C  -0.028193 1.676522 0.000185
C  2.504977 1.61869 0.000191
C  2.400818 -1.213071 0.000054
C  -2.539248 1.610815 0.000296
C  -2.369028 -1.245198 0.00013
C  3.660385 -0.548436 0.000112
C  3.696534 0.884734 0.00016
C  -3.686269 -0.608912 0.000112
C  -3.698943 0.87001 0.000303
H  -0.031877 2.77299 0.00024
H  2.542938 2.714478 0.000243
H  2.330784 -2.30529 0.000006
H  -2.574061 2.707389 0.000399
H  -2.327364 -2.337023 0.000083
H  4.663438 1.400583 0.000183
H  -4.677627 1.368229 0.000426
H  4.827125 -2.295914 -0.000045
H  5.743266 -0.81226 0.000026
H  -5.648929 -0.820337 0.000584
