program: Orca
programVersion: 5.0.2
elementType: O O O C C C C C C C C C C C C C C C C C C C C C C C H H H H H H H H H H H H H H H H H H H H H H H H H H
charge: 0
multiplicity: 1
keywords: wb97x-d3
keywords: def2-TZVPP
keywords: def2/J RIJCOSX
keywords: DEFGRID2
keywords: scfconv7
keywords: smallprint printgap noloewdin
keywords: NOSOSCF
formula: C23H26O3
InChI: InChI=1/C23H26O3/c1-16(2)13-20-21(23(20,3)4)22(24)25-15-17-9-8-12-19(14-17)26-18-10-6-5-7-11-18/h5-14,20-21H,15H2,1-4H3
52 atoms
O  -1.70507 1.091487 -0.514365
O  -3.825123 1.695954 -0.210292
O  3.301278 0.82964 0.134079
C  -2.619106 -1.761173 -0.948329
C  -2.516669 -1.626146 0.53209
C  -3.333036 -0.60685 -0.269456
C  -3.547742 -2.83282 -1.473583
C  -1.416269 -1.557851 -1.837135
C  -1.254067 -1.274513 1.229677
C  -2.990255 0.825621 -0.328257
C  -1.191664 -0.687678 2.428071
C  0.118368 -0.418823 3.101578
C  -2.404431 -0.259847 3.196858
C  -1.300298 2.459772 -0.519423
C  0.177678 2.519213 -0.773751
C  1.045891 1.596257 -0.20022
C  0.691402 3.550536 -1.553326
C  2.410861 1.700073 -0.432721
C  2.059457 3.658853 -1.75387
C  2.928735 2.728539 -1.205935
C  3.038916 -0.512556 0.125373
C  2.455335 -1.147286 -0.964903
C  3.431308 -1.241024 1.240089
C  2.258514 -2.520283 -0.924126
C  3.236024 -2.614697 1.26272
C  2.642983 -3.25994 0.186396
H  -3.163167 -2.292843 1.097383
H  -4.406512 -0.730076 -0.182669
H  -3.029377 -3.791798 -1.53911
H  -3.910024 -2.582882 -2.472933
H  -4.417738 -2.971096 -0.830378
H  -1.716392 -1.155273 -2.806621
H  -0.940097 -2.52342 -2.020564
H  -0.658586 -0.897279 -1.426012
H  -0.3237 -1.555292 0.74244
H  0.265328 0.652875 3.261285
H  0.96401 -0.793423 2.524731
H  0.154875 -0.884082 4.090677
H  -3.31917 -0.283179 2.606747
H  -2.281043 0.754726 3.583064
H  -2.556637 -0.903092 4.06834
H  -1.538086 2.917257 0.445473
H  -1.837463 3.016243 -1.290493
H  0.665127 0.799873 0.428405
H  0.021122 4.270612 -2.006573
H  2.453031 4.464982 -2.359253
H  3.995995 2.797775 -1.374182
H  2.162448 -0.586119 -1.843433
H  3.885916 -0.734464 2.082419
H  1.805493 -3.013117 -1.774787
H  3.542647 -3.179319 2.133885
H  2.486194 -4.330236 0.209607
elementType: O C H
totalener: -1117.86397888 hartree
nucrepener: 2392.60700616 hartree
electener: -3510.47098503 hartree
oneelecener: -6274.21548758 hartree
twoeener: 2763.74450255 hartree
cpcmener: -0.02474142 hartree
kineticenergy: 1112.80110341 hartree
xcener: -110.230768222898 hartree
chargesum: -0.0000000
charge: -0.262795 -0.477958 -0.330826 0.156142 -0.020630 -0.139683 -0.269688 -0.274904 -0.209493 0.406036 -0.041483 -0.194211 -0.268751 0.076169 0.013324 -0.157679 -0.215375 0.253948 -0.125739 -0.227675 0.290577 -0.193614 -0.241905 -0.149623 -0.119813 -0.184768 0.110163 0.093869 0.093413 0.095839 0.086490 0.108179 0.098640 0.054202 0.087983 0.097434 0.050841 0.107119 0.091304 0.095465 0.109672 0.118351 0.109240 0.082367 0.141612 0.157161 0.145335 0.156403 0.145787 0.159053 0.157717 0.156781
qa: -0.2628 -0.4780 -0.3308 0.1561 -0.0206 -0.1397 -0.2697 -0.2749 -0.2095 0.4060 -0.0415 -0.1942 -0.2688 0.0762 0.0133 -0.1577 -0.2154 0.2539 -0.1257 -0.2277 0.2906 -0.1936 -0.2419 -0.1496 -0.1198 -0.1848 0.1102 0.0939 0.0934 0.0958 0.0865 0.1082 0.0986 0.0542 0.0880 0.0974 0.0508 0.1071 0.0913 0.0955 0.1097 0.1184 0.1092 0.0824 0.1416 0.1572 0.1453 0.1564 0.1458 0.1591 0.1577 0.1568
va: 2.1170 2.0285 2.0829 3.7190 3.7861 3.8647 3.9055 3.9164 3.7949 4.1258 3.7220 3.8931 3.9405 3.8069 3.7493 3.8672 3.9473 3.7247 3.9057 3.9931 3.6576 3.8390 3.9479 3.8477 3.8652 3.8967 1.0059 1.0290 1.0020 1.0019 1.0053 1.0054 0.9982 1.0021 1.0035 1.0012 1.0262 1.0003 1.0074 0.9995 0.9968 0.9932 1.0073 1.0369 1.0022 0.9893 1.0065 0.9967 1.0091 0.9903 0.9885 0.9910
dispcorr: -0.031211756 hartree
energy: -1117.895190631090
dipole: -10.98175 11.54680 0.56506 -12.97729 12.08269 -0.89460 5.19243 -5.29420 -0.10176
magnitude: 1.06299 au
magnitude: 2.70191 debye
