program: Orca
programVersion: 5.0.2
elementType: O O O C C C C C C C C C C C C C C C C C C C C C C C H H H H H H H H H H H H H H H H H H H H H H H H H H
charge: 0
multiplicity: 1
keywords: wb97x-d3
keywords: def2-TZVPP
keywords: def2/J RIJCOSX
keywords: DEFGRID2
keywords: scfconv7
keywords: smallprint printgap noloewdin
keywords: NOSOSCF
formula: C23H26O3
InChI: InChI=1/C23H26O3/c1-16(2)13-20-21(23(20,3)4)22(24)25-15-17-9-8-12-19(14-17)26-18-10-6-5-7-11-18/h5-14,20-21H,15H2,1-4H3
52 atoms
O  -2.194474 1.370856 -1.539243
O  -2.321933 -0.788005 -0.981052
O  3.74744 0.315852 -1.540315
C  -5.240613 -0.160437 -0.092603
C  -4.39331 0.194915 1.080274
C  -4.045341 0.745839 -0.312127
C  -6.576671 0.538603 -0.201158
C  -5.2799 -1.566709 -0.63737
C  -3.521895 -0.779281 1.776979
C  -2.796623 0.32147 -0.962715
C  -2.632837 -0.463321 2.72365
C  -1.826085 -1.519132 3.415481
C  -2.355515 0.938212 3.173737
C  -0.943856 1.158911 -2.175656
C  0.211547 1.041639 -1.216468
C  1.448074 0.685078 -1.743763
C  0.100577 1.303062 0.143858
C  2.563972 0.6036 -0.924778
C  1.222285 1.202167 0.956339
C  2.460844 0.85997 0.438152
C  4.741478 -0.336184 -0.860786
C  6.023491 0.186351 -0.944374
C  4.497379 -1.513459 -0.164302
C  7.073007 -0.479085 -0.325885
C  5.553461 -2.161588 0.458765
C  6.842482 -1.649604 0.382796
H  -4.80538 0.96868 1.720788
H  -4.280204 1.793522 -0.459851
H  -6.90329 0.599646 -1.241352
H  -6.541071 1.554121 0.195926
H  -7.341195 -0.007542 0.355225
H  -4.345923 -2.11205 -0.542412
H  -5.547399 -1.555843 -1.695775
H  -6.049348 -2.137618 -0.113486
H  -3.639723 -1.826833 1.519923
H  -0.756384 -1.363232 3.2503
H  -2.076411 -2.522379 3.070607
H  -1.978429 -1.486644 4.497827
H  -1.283638 1.149279 3.132666
H  -2.652706 1.07683 4.217253
H  -2.864312 1.695699 2.580116
H  -0.802895 2.033672 -2.812233
H  -0.982759 0.286464 -2.83248
H  1.550395 0.475192 -2.803049
H  -0.84316 1.593211 0.58625
H  1.132638 1.403718 2.016299
H  3.324226 0.805037 1.088431
H  6.198081 1.103041 -1.493883
H  3.497598 -1.926523 -0.111157
H  8.073773 -0.072353 -0.394427
H  5.365049 -3.078633 1.00201
H  7.661575 -2.16264 0.869348
elementType: O C H
totalener: -1117.86677026 hartree
nucrepener: 2224.56714328 hartree
electener: -3342.43391354 hartree
oneelecener: -5939.08475006 hartree
twoeener: 2596.65083652 hartree
cpcmener: -0.02719831 hartree
kineticenergy: 1112.79401093 hartree
xcener: -110.227889075756 hartree
chargesum: -0.0000000
charge: -0.299941 -0.457010 -0.328183 0.137448 -0.031626 -0.075118 -0.258189 -0.297165 -0.240419 0.357696 -0.028666 -0.223910 -0.293224 0.083725 0.034217 -0.266478 -0.220570 0.275077 -0.161350 -0.189612 0.265994 -0.232987 -0.186542 -0.129045 -0.145473 -0.177292 0.109419 0.091710 0.095164 0.086068 0.094706 0.092774 0.100241 0.099388 0.122133 0.091544 0.088745 0.094172 0.090875 0.114336 0.093891 0.129913 0.114936 0.128242 0.162497 0.156129 0.153100 0.145411 0.159130 0.157597 0.159098 0.157424
qa: -0.2999 -0.4570 -0.3282 0.1374 -0.0316 -0.0751 -0.2582 -0.2972 -0.2404 0.3577 -0.0287 -0.2239 -0.2932 0.0837 0.0342 -0.2665 -0.2206 0.2751 -0.1613 -0.1896 0.2660 -0.2330 -0.1865 -0.1290 -0.1455 -0.1773 0.1094 0.0917 0.0952 0.0861 0.0947 0.0928 0.1002 0.0994 0.1221 0.0915 0.0887 0.0942 0.0909 0.1143 0.0939 0.1299 0.1149 0.1282 0.1625 0.1561 0.1531 0.1454 0.1591 0.1576 0.1591 0.1574
va: 2.1113 2.0277 2.0729 3.7775 3.7910 3.8360 3.8914 3.8948 3.8419 4.1216 3.7028 3.9282 3.9563 3.8223 3.6946 4.0733 3.9328 3.7365 3.9390 3.9132 3.7013 4.0063 3.9202 3.8866 3.8900 3.8988 1.0023 1.0313 1.0029 1.0046 1.0024 1.0202 0.9998 0.9989 1.0034 0.9974 1.0084 0.9957 0.9948 1.0002 1.0050 0.9906 1.0127 1.0189 0.9919 0.9938 0.9989 1.0076 0.9955 0.9894 0.9903 0.9906
dispcorr: -0.025331305 hartree
energy: -1117.892101566091
dipole: -25.10987 24.78202 -0.32785 -3.50176 4.23356 0.73180 14.67145 -13.96874 0.70272
magnitude: 1.06622 au
magnitude: 2.71012 debye
