program: Orca
programVersion: 5.0.2
elementType: O O O C C C C C C C C C C C C C C C C C C C C C C C H H H H H H H H H H H H H H H H H H H H H H H H H H
charge: 0
multiplicity: 1
keywords: wb97x-d3
keywords: def2-TZVPP
keywords: def2/J RIJCOSX
keywords: DEFGRID2
keywords: scfconv7
keywords: smallprint printgap noloewdin
keywords: NOSOSCF
formula: C23H26O3
InChI: InChI=1/C23H26O3/c1-16(2)13-20-21(23(20,3)4)22(24)25-15-17-9-8-12-19(14-17)26-18-10-6-5-7-11-18/h5-14,20-21H,15H2,1-4H3
52 atoms
O  -1.086219 1.956701 0.741762
O  -1.185529 -0.269934 0.840496
O  3.329532 -0.851191 -2.080771
C  -4.124384 0.210513 -0.14766
C  -4.239208 0.099565 1.340167
C  -3.201296 1.040249 0.729539
C  -5.198661 0.998002 -0.859661
C  -3.591836 -0.933677 -0.973861
C  -3.890023 -1.115764 2.100227
C  -1.750175 0.796114 0.781364
C  -4.571197 -1.603397 3.144524
C  -4.115352 -2.853994 3.836289
C  -5.807091 -0.994729 3.735848
C  0.337114 1.896158 0.669705
C  0.818707 1.415532 -0.671204
C  1.859076 0.499322 -0.736963
C  0.247587 1.896676 -1.847137
C  2.338041 0.084188 -1.973849
C  0.719225 1.456519 -3.073637
C  1.772253 0.555606 -3.147662
C  4.446738 -0.752826 -1.297771
C  5.064026 0.464851 -1.036172
C  4.985999 -1.937427 -0.815568
C  6.228629 0.484661 -0.281819
C  6.156741 -1.902511 -0.071926
C  6.780664 -0.693396 0.203091
H  -5.067473 0.662437 1.754444
H  -3.459195 2.09118 0.790136
H  -6.043757 0.353622 -1.111116
H  -4.819648 1.426613 -1.789919
H  -5.578253 1.81694 -0.2468
H  -2.876512 -1.565828 -0.455709
H  -3.108304 -0.561223 -1.879247
H  -4.421964 -1.570874 -1.285382
H  -3.012509 -1.664799 1.781965
H  -3.917452 -2.665881 4.895569
H  -3.207176 -3.265545 3.394689
H  -4.887103 -3.628368 3.801308
H  -6.192483 -0.138238 3.184749
H  -5.622651 -0.66853 4.764266
H  -6.609847 -1.735769 3.788946
H  0.744385 1.281876 1.475428
H  0.662958 2.922476 0.842899
H  2.286873 0.104739 0.177714
H  -0.565128 2.611446 -1.811842
H  0.272555 1.827009 -3.987217
H  2.148019 0.218639 -4.105491
H  4.652211 1.390505 -1.418833
H  4.493913 -2.878624 -1.027304
H  6.709726 1.433001 -0.079043
H  6.576714 -2.828167 0.300206
H  7.690677 -0.668873 0.788013
elementType: O C H
totalener: -1117.86739819 hartree
nucrepener: 2191.22099722 hartree
electener: -3309.08839541 hartree
oneelecener: -5872.53672608 hartree
twoeener: 2563.44833067 hartree
cpcmener: -0.02591485 hartree
kineticenergy: 1112.79770865 hartree
xcener: -110.226792573311 hartree
chargesum: 0.0000000
charge: -0.293589 -0.464413 -0.331805 0.102376 0.027315 -0.083831 -0.261644 -0.281339 -0.289600 0.384017 -0.056787 -0.218260 -0.257062 0.101844 0.036020 -0.178271 -0.253257 0.239519 -0.114467 -0.240843 0.260294 -0.170328 -0.240846 -0.153217 -0.124150 -0.183414 0.117541 0.094860 0.094416 0.093089 0.086350 0.096211 0.098926 0.097984 0.122679 0.091574 0.088366 0.092364 0.088456 0.097867 0.093637 0.112632 0.121150 0.140972 0.140605 0.156160 0.146166 0.153946 0.146493 0.159086 0.156745 0.157466
qa: -0.2936 -0.4644 -0.3318 0.1024 0.0273 -0.0838 -0.2616 -0.2813 -0.2896 0.3840 -0.0568 -0.2183 -0.2571 0.1018 0.0360 -0.1783 -0.2533 0.2395 -0.1145 -0.2408 0.2603 -0.1703 -0.2408 -0.1532 -0.1241 -0.1834 0.1175 0.0949 0.0944 0.0931 0.0863 0.0962 0.0989 0.0980 0.1227 0.0916 0.0884 0.0924 0.0885 0.0979 0.0936 0.1126 0.1211 0.1410 0.1406 0.1562 0.1462 0.1539 0.1465 0.1591 0.1567 0.1575
va: 2.1149 2.0317 2.0666 3.7118 3.7500 3.8370 3.9096 3.9085 3.8557 4.1250 3.7870 3.9224 3.9387 3.8061 3.6155 3.9416 3.9544 3.7424 3.8917 4.0195 3.7171 3.8909 3.9993 3.8995 3.8906 3.9012 1.0023 1.0302 1.0018 1.0026 1.0055 1.0140 1.0004 1.0012 1.0251 0.9959 1.0090 0.9967 1.0137 0.9961 0.9976 1.0118 0.9912 1.0082 1.0127 0.9893 1.0057 0.9984 1.0079 0.9904 0.9894 0.9905
dispcorr: -0.023345109 hartree
energy: -1117.890743295158
dipole: -30.99613 30.40611 -0.59002 -5.12179 6.29784 1.17605 11.76430 -11.47461 0.28970
magnitude: 1.34728 au
magnitude: 3.42450 debye
