program: Orca
programVersion: 5.0.2
elementType: O O O C C C C C C C C C C C C C C C C C C C C C C C H H H H H H H H H H H H H H H H H H H H H H H H H H
charge: 0
multiplicity: 1
keywords: wb97x-d3
keywords: def2-TZVPP
keywords: def2/J RIJCOSX
keywords: DEFGRID2
keywords: scfconv7
keywords: smallprint printgap noloewdin
keywords: NOSOSCF
formula: C23H26O3
InChI: InChI=1/C23H26O3/c1-16(2)13-20-21(23(20,3)4)22(24)25-15-17-9-8-12-19(14-17)26-18-10-6-5-7-11-18/h5-14,20-21H,15H2,1-4H3
52 atoms
O  -1.773044 1.578709 -1.50256
O  -1.811216 1.878061 0.708265
O  2.426351 -0.975476 -0.887004
C  -2.56976 -1.200568 0.503849
C  -3.840862 -0.481228 0.842585
C  -2.976695 0.026154 -0.301355
C  -2.685949 -2.516809 -0.225843
C  -1.391124 -1.152747 1.443442
C  -4.052941 0.251654 2.106761
C  -2.155185 1.24849 -0.262722
C  -5.144398 0.158946 2.875286
C  -5.264448 0.968052 4.13238
C  -6.336619 -0.701539 2.576448
C  -0.773567 2.585368 -1.635373
C  0.566192 2.118298 -1.133686
C  0.942349 0.786905 -1.266076
C  1.450642 3.025044 -0.561313
C  2.178192 0.363562 -0.797843
C  2.691616 2.593985 -0.115681
C  3.066246 1.262597 -0.219404
C  3.707537 -1.439199 -1.021489
C  4.565761 -0.941911 -1.99477
C  4.101387 -2.478557 -0.1920
C  5.831095 -1.494965 -2.126678
C  5.366074 -3.030459 -0.343019
C  6.237377 -2.538197 -1.304183
H  -4.729896 -0.971461 0.461567
H  -3.35801 -0.19658 -1.291409
H  -2.78436 -3.341726 0.48314
H  -1.798143 -2.707335 -0.832829
H  -3.553291 -2.542369 -0.886837
H  -1.48385 -1.949715 2.184089
H  -1.289752 -0.217642 1.988024
H  -0.458835 -1.321649 0.899648
H  -3.264912 0.91501 2.439519
H  -6.165912 1.587334 4.116039
H  -4.409503 1.627039 4.284513
H  -5.352869 0.321827 5.009931
H  -6.141503 -1.489681 1.851495
H  -7.167966 -0.101046 2.196095
H  -6.697306 -1.18275 3.488261
H  -1.073885 3.509614 -1.137257
H  -0.730216 2.789804 -2.705992
H  0.280159 0.059043 -1.719937
H  1.165619 4.063908 -0.449292
H  3.374323 3.300208 0.33891
H  4.026319 0.938586 0.161117
H  4.253041 -0.135992 -2.647509
H  3.419508 -2.857023 0.559351
H  6.501133 -1.108511 -2.883936
H  5.67095 -3.844823 0.301547
H  7.223983 -2.968053 -1.416921
elementType: O C H
totalener: -1117.86643732 hartree
nucrepener: 2227.02856510 hartree
electener: -3344.89500242 hartree
oneelecener: -5944.14660905 hartree
twoeener: 2599.25160663 hartree
cpcmener: -0.02561955 hartree
kineticenergy: 1112.79894405 hartree
xcener: -110.228006215135 hartree
chargesum: -0.0000000
charge: -0.293103 -0.455215 -0.331894 0.109875 0.029665 -0.074391 -0.261467 -0.284100 -0.307812 0.356202 -0.029440 -0.221803 -0.269512 0.099558 0.075532 -0.332032 -0.236019 0.318777 -0.124647 -0.215179 0.250821 -0.175859 -0.227087 -0.154120 -0.135296 -0.170241 0.113807 0.096970 0.094480 0.093066 0.087336 0.104812 0.097434 0.091573 0.122255 0.092185 0.087640 0.092491 0.091523 0.102722 0.092478 0.113565 0.120252 0.132032 0.140479 0.158338 0.154723 0.157044 0.147250 0.158658 0.157590 0.158086
qa: -0.2931 -0.4552 -0.3319 0.1099 0.0297 -0.0744 -0.2615 -0.2841 -0.3078 0.3562 -0.0294 -0.2218 -0.2695 0.0996 0.0755 -0.3320 -0.2360 0.3188 -0.1246 -0.2152 0.2508 -0.1759 -0.2271 -0.1541 -0.1353 -0.1702 0.1138 0.0970 0.0945 0.0931 0.0873 0.1048 0.0974 0.0916 0.1223 0.0922 0.0876 0.0925 0.0915 0.1027 0.0925 0.1136 0.1203 0.1320 0.1405 0.1583 0.1547 0.1570 0.1473 0.1587 0.1576 0.1581
va: 2.1054 2.0336 2.0479 3.7093 3.7559 3.8434 3.9070 3.9053 3.8763 4.1612 3.7493 3.9277 3.9430 3.8037 3.5967 4.0313 3.9909 3.6751 3.9009 3.9374 3.7241 3.9155 3.9951 3.8984 3.8925 3.8911 1.0041 1.0298 1.0017 1.0036 1.0052 1.0026 1.0135 1.0062 1.0265 0.9946 1.0093 0.9963 1.0083 0.9947 0.9985 1.0106 0.9923 1.0294 1.0035 0.9904 0.9980 0.9967 1.0055 0.9905 0.9899 0.9900
dispcorr: -0.024516016 hartree
energy: -1117.890953334483
dipole: -22.96999 23.23201 0.26202 -7.35502 6.88216 -0.47285 13.86783 -14.56323 -0.69540
magnitude: 0.88081 au
magnitude: 2.23885 debye
