program: Orca
programVersion: 5.0.2
elementType: O O O C C C C C C C C C C C C C C C C C C C C C C C H H H H H H H H H H H H H H H H H H H H H H H H H H
charge: 0
multiplicity: 1
keywords: wb97x-d3
keywords: def2-TZVPP
keywords: def2/J RIJCOSX
keywords: DEFGRID2
keywords: scfconv7
keywords: smallprint printgap noloewdin
keywords: NOSOSCF
formula: C23H26O3
InChI: InChI=1/C23H26O3/c1-16(2)13-20-21(23(20,3)4)22(24)25-15-17-9-8-12-19(14-17)26-18-10-6-5-7-11-18/h5-14,20-21H,15H2,1-4H3
52 atoms
O  -1.899411 1.7555 -1.107541
O  -1.512432 1.246584 1.029828
O  2.694917 -0.068382 -1.977731
C  -2.226337 -1.635742 -0.046394
C  -3.404201 -1.129713 0.709446
C  -2.774063 -0.248851 -0.363725
C  -2.4735 -2.676636 -1.112104
C  -0.885914 -1.792969 0.627802
C  -3.364536 -0.800011 2.153968
C  -2.010865 0.963529 -0.032565
C  -4.227215 0.035168 2.736625
C  -4.191342 0.304078 4.207896
C  -5.270405 0.766833 1.938721
C  -1.042243 2.887316 -0.988704
C  0.401004 2.497077 -0.820023
C  0.909026 1.368052 -1.455811
C  1.241607 3.27239 -0.032017
C  2.241875 1.027931 -1.295042
C  2.580103 2.930108 0.107369
C  3.092963 1.806078 -0.519635
C  3.404747 -1.036863 -1.328017
C  4.303164 -1.767375 -2.095395
C  3.218688 -1.335904 0.017363
C  5.017432 -2.802853 -1.511789
C  3.949377 -2.36913 0.588741
C  4.849911 -3.106556 -0.167158
H  -4.361144 -1.525319 0.37482
H  -3.321552 -0.181065 -1.296876
H  -2.453447 -3.679691 -0.679641
H  -1.706037 -2.635085 -1.887782
H  -3.442971 -2.545364 -1.595105
H  -0.078898 -1.707444 -0.104273
H  -0.813675 -2.788468 1.074182
H  -0.694627 -1.069362 1.417335
H  -2.61441 -1.294747 2.763574
H  -3.415139 -0.271503 4.712844
H  -5.148997 0.063759 4.678037
H  -4.008715 1.36352 4.407731
H  -5.981736 0.08105 1.470996
H  -4.822685 1.351764 1.131327
H  -5.845991 1.454289 2.558869
H  -1.362952 3.539094 -0.171918
H  -1.18287 3.438434 -1.920566
H  0.277941 0.740576 -2.074445
H  0.85057 4.142539 0.481083
H  3.231232 3.540738 0.719788
H  4.136752 1.5417 -0.403853
H  4.437118 -1.527082 -3.142873
H  2.511322 -0.781933 0.621805
H  5.71574 -3.369676 -2.114096
H  3.803801 -2.598881 1.636791
H  5.414643 -3.910612 0.286046
elementType: O C H
totalener: -1117.86474042 hartree
nucrepener: 2291.59461973 hartree
electener: -3409.45936015 hartree
oneelecener: -6073.36929109 hartree
twoeener: 2663.90993094 hartree
cpcmener: -0.02655267 hartree
kineticenergy: 1112.79949654 hartree
xcener: -110.226911505507 hartree
chargesum: -0.0000000
charge: -0.298726 -0.451318 -0.330474 0.140176 -0.033707 -0.075388 -0.263450 -0.306260 -0.250184 0.350234 -0.023888 -0.225156 -0.274549 0.097618 0.050668 -0.288772 -0.215254 0.264155 -0.125058 -0.190762 0.316653 -0.254267 -0.211761 -0.122607 -0.159538 -0.187712 0.115135 0.092861 0.094457 0.095937 0.086431 0.091141 0.107110 0.098335 0.122955 0.084902 0.097589 0.096927 0.100604 0.097235 0.096676 0.114419 0.120021 0.130361 0.140907 0.157282 0.157499 0.144945 0.153134 0.156569 0.158560 0.157339
qa: -0.2987 -0.4513 -0.3305 0.1402 -0.0337 -0.0754 -0.2635 -0.3063 -0.2502 0.3502 -0.0239 -0.2252 -0.2745 0.0976 0.0507 -0.2888 -0.2153 0.2642 -0.1251 -0.1908 0.3167 -0.2543 -0.2118 -0.1226 -0.1595 -0.1877 0.1151 0.0929 0.0945 0.0959 0.0864 0.0911 0.1071 0.0983 0.1230 0.0849 0.0976 0.0969 0.1006 0.0972 0.0967 0.1144 0.1200 0.1304 0.1409 0.1573 0.1575 0.1449 0.1531 0.1566 0.1586 0.1573
va: 2.1017 2.0301 2.0617 3.7684 3.8559 3.8081 3.8971 3.9019 3.8052 4.1236 3.6974 3.9230 3.9522 3.8094 3.6084 4.0299 3.9778 3.7350 3.8916 3.9393 3.6526 4.0035 3.8753 3.8923 3.9163 3.9063 1.0007 1.0316 1.0021 1.0027 1.0051 1.0008 1.0004 1.0137 0.9991 1.0087 0.9935 0.9935 0.9974 0.9967 1.0060 1.0089 0.9923 1.0294 1.0030 0.9904 0.9952 1.0091 0.9992 0.9894 0.9909 0.9905
dispcorr: -0.026337408 hartree
energy: -1117.891077828682
dipole: -20.12619 19.76819 -0.35800 -8.33632 8.24808 -0.08824 12.39128 -12.64081 -0.24952
magnitude: 0.44521 au
magnitude: 1.13164 debye
