program: Orca
programVersion: 5.0.2
elementType: O O O C C C C C C C C C C C C C C C C C C C C C C C H H H H H H H H H H H H H H H H H H H H H H H H H H
charge: 0
multiplicity: 1
keywords: wb97x-d3
keywords: def2-TZVPP
keywords: def2/J RIJCOSX
keywords: DEFGRID2
keywords: scfconv7
keywords: smallprint printgap noloewdin
keywords: NOSOSCF
formula: C23H26O3
InChI: InChI=1/C23H26O3/c1-16(2)13-20-21(23(20,3)4)22(24)25-15-17-9-8-12-19(14-17)26-18-10-6-5-7-11-18/h5-14,20-21H,15H2,1-4H3
52 atoms
O  -2.170524 1.095935 -0.704309
O  -4.096075 2.168029 -1.031382
O  2.570201 -0.571632 -1.241229
C  -4.013788 -1.379092 -0.36282
C  -3.492833 -0.951554 0.967495
C  -4.155821 0.076435 0.057723
C  -5.305708 -2.160589 -0.395988
C  -3.061216 -1.776913 -1.463395
C  -2.043559 -0.983679 1.294794
C  -3.485734 1.209254 -0.610808
C  -1.403721 -0.13017 2.095931
C  0.062187 -0.273522 2.368152
C  -2.060434 1.050597 2.738839
C  -1.426276 2.160166 -1.303653
C  0.010357 1.967779 -0.916445
C  0.665741 0.77879 -1.219825
C  0.691685 2.97097 -0.238067
C  1.993849 0.604316 -0.859814
C  2.024796 2.792081 0.106258
C  2.688258 1.615818 -0.203176
C  3.615275 -1.112994 -0.543191
C  3.617751 -1.19895 0.844037
C  4.65869 -1.647106 -1.285878
C  4.68113 -1.820416 1.4821
C  5.710572 -2.27563 -0.634687
C  5.730003 -2.361176 0.750352
H  -4.138247 -1.206512 1.805442
H  -5.164362 0.353708 0.343504
H  -5.981665 -1.865195 0.407616
H  -5.110985 -3.229887 -0.287746
H  -5.830643 -2.013878 -1.342384
H  -3.494023 -1.562341 -2.442742
H  -2.878506 -2.852716 -1.419284
H  -2.092976 -1.285077 -1.414443
H  -1.474274 -1.801153 0.859981
H  0.261864 -0.370811 3.438801
H  0.608573 0.612894 2.031801
H  0.48636 -1.143472 1.86676
H  -3.127726 1.115074 2.533725
H  -1.596377 1.981244 2.399638
H  -1.931171 1.024458 3.824119
H  -1.785894 3.129325 -0.954746
H  -1.552773 2.125309 -2.389151
H  0.151256 -0.017981 -1.745118
H  0.184874 3.893046 0.018208
H  2.558174 3.579761 0.622394
H  3.730783 1.499287 0.06333
H  2.800468 -0.793359 1.427031
H  4.641802 -1.577404 -2.366412
H  4.681696 -1.887284 2.562479
H  6.520789 -2.694731 -1.217352
H  6.553927 -2.847102 1.256068
elementType: O C H
totalener: -1117.86274557 hartree
nucrepener: 2317.76960661 hartree
electener: -3435.63235217 hartree
oneelecener: -6124.66291121 hartree
twoeener: 2689.03055904 hartree
cpcmener: -0.02596936 hartree
kineticenergy: 1112.80709469 hartree
xcener: -110.229156845633 hartree
chargesum: 0.0000000
charge: -0.254351 -0.478322 -0.324942 0.133961 0.000684 -0.163913 -0.270149 -0.284278 -0.255469 0.424517 -0.022575 -0.237607 -0.271176 0.064815 0.008428 -0.277629 -0.201693 0.287266 -0.128166 -0.205158 0.269774 -0.177700 -0.223930 -0.183145 -0.137221 -0.165071 0.113946 0.094867 0.086053 0.092754 0.095317 0.103434 0.099244 0.079950 0.121912 0.111704 0.077307 0.093811 0.096304 0.092200 0.107380 0.101784 0.125733 0.139312 0.142790 0.157885 0.152992 0.170015 0.145037 0.156149 0.157871 0.157296
qa: -0.2544 -0.4783 -0.3249 0.1340 0.0007 -0.1639 -0.2701 -0.2843 -0.2555 0.4245 -0.0226 -0.2376 -0.2712 0.0648 0.0084 -0.2776 -0.2017 0.2873 -0.1282 -0.2052 0.2698 -0.1777 -0.2239 -0.1831 -0.1372 -0.1651 0.1139 0.0949 0.0861 0.0928 0.0953 0.1034 0.0992 0.0800 0.1219 0.1117 0.0773 0.0938 0.0963 0.0922 0.1074 0.1018 0.1257 0.1393 0.1428 0.1579 0.1530 0.1700 0.1450 0.1561 0.1579 0.1573
va: 2.1151 2.0290 2.0813 3.7268 3.7775 3.8806 3.9089 3.9169 3.8372 4.1090 3.6787 3.9334 3.9498 3.8166 3.7143 3.9687 3.9185 3.7381 3.8929 3.8960 3.6844 3.8741 3.9896 3.9569 3.8929 3.8913 1.0043 1.0282 1.0054 1.0017 1.0016 1.0014 1.0001 1.0047 0.9977 1.0014 0.9940 0.9991 1.0032 0.9995 1.0009 1.0141 0.9940 1.0179 1.0019 0.9909 0.9982 0.9799 1.0077 0.9930 0.9893 0.9905
dispcorr: -0.029221728 hartree
energy: -1117.891967293913
dipole: -11.97022 13.18728 1.21707 -7.38025 6.73097 -0.64928 9.61864 -8.77865 0.83999
magnitude: 1.61505 au
magnitude: 4.10514 debye
