program: Orca
programVersion: 5.0.2
elementType: O O O C C C C C C C C C C C C C C C C C C C C C C C H H H H H H H H H H H H H H H H H H H H H H H H H H
charge: 0
multiplicity: 1
keywords: wb97x-d3
keywords: def2-TZVPP
keywords: def2/J RIJCOSX
keywords: DEFGRID2
keywords: scfconv7
keywords: smallprint printgap noloewdin
keywords: NOSOSCF
formula: C23H26O3
InChI: InChI=1/C23H26O3/c1-16(2)13-20-21(23(20,3)4)22(24)25-15-17-9-8-12-19(14-17)26-18-10-6-5-7-11-18/h5-14,20-21H,15H2,1-4H3
52 atoms
O  -1.899288 1.803253 -1.404039
O  -1.49681 1.628204 0.783015
O  2.757701 -0.026708 -2.070155
C  -2.16712 -1.401277 -0.012091
C  -3.32851 -0.884557 0.78347
C  -2.78164 -0.055207 -0.368008
C  -2.440739 -2.516106 -0.991857
C  -0.793695 -1.48024 0.606551
C  -3.227559 -0.511421 2.208752
C  -2.007297 1.190029 -0.219217
C  -4.067307 -0.905683 3.173489
C  -3.850366 -0.475335 4.594012
C  -5.269769 -1.778259 2.976503
C  -1.062489 2.954232 -1.473999
C  0.394463 2.62802 -1.288976
C  0.920589 1.421512 -1.742358
C  1.234467 3.552406 -0.680982
C  2.269682 1.156406 -1.578553
C  2.588553 3.281047 -0.538484
C  3.117865 2.080411 -0.98255
C  3.344967 -0.915253 -1.215935
C  4.231697 -1.82458 -1.780993
C  3.062185 -0.9596 0.144739
C  4.836715 -2.780147 -0.979675
C  3.681995 -1.919311 0.934177
C  4.570725 -2.830831 0.382706
H  -4.273213 -1.341471 0.510683
H  -3.390806 -0.068074 -1.264827
H  -1.721731 -2.502001 -1.813894
H  -3.440263 -2.443092 -1.422614
H  -2.362513 -3.488254 -0.500136
H  -0.02476 -1.464597 -0.168666
H  -0.688946 -2.42363 1.146612
H  -0.572588 -0.680697 1.309458
H  -2.395844 0.115404 2.503726
H  -4.727742 0.048567 4.983681
H  -2.99102 0.186771 4.699767
H  -3.693274 -1.338064 5.247307
H  -5.372269 -2.178201 1.970082
H  -6.186232 -1.22954 3.209633
H  -5.240312 -2.6283 3.663105
H  -1.381162 3.712703 -0.755478
H  -1.235773 3.35735 -2.472765
H  0.292268 0.678966 -2.220017
H  0.83094 4.487792 -0.312909
H  3.237343 4.008701 -0.06853
H  4.172877 1.865269 -0.86623
H  4.442182 -1.781761 -2.842494
H  2.365937 -0.263676 0.595129
H  5.52633 -3.485298 -1.425856
H  3.460803 -1.94998 1.993407
H  5.050038 -3.573603 1.006615
elementType: O C H
totalener: -1117.86641559 hartree
nucrepener: 2275.55387571 hartree
electener: -3393.42029130 hartree
oneelecener: -6041.01873008 hartree
twoeener: 2647.59843879 hartree
cpcmener: -0.02546684 hartree
kineticenergy: 1112.79862483 hartree
xcener: -110.228030582217 hartree
chargesum: -0.0000000
charge: -0.291220 -0.455680 -0.331399 0.126718 0.020956 -0.082149 -0.262350 -0.293686 -0.295505 0.366057 -0.044992 -0.221954 -0.257389 0.093795 0.045027 -0.283061 -0.205254 0.252587 -0.130080 -0.178208 0.314344 -0.245799 -0.218667 -0.126183 -0.164293 -0.187598 0.115206 0.097224 0.093460 0.086878 0.094964 0.091248 0.106801 0.098189 0.121469 0.091350 0.088430 0.092666 0.088626 0.098094 0.093054 0.115102 0.121102 0.135271 0.140502 0.158568 0.157383 0.144200 0.153323 0.157098 0.158163 0.157613
qa: -0.2912 -0.4557 -0.3314 0.1267 0.0210 -0.0821 -0.2624 -0.2937 -0.2955 0.3661 -0.0450 -0.2220 -0.2574 0.0938 0.0450 -0.2831 -0.2053 0.2526 -0.1301 -0.1782 0.3143 -0.2458 -0.2187 -0.1262 -0.1643 -0.1876 0.1152 0.0972 0.0935 0.0869 0.0950 0.0912 0.1068 0.0982 0.1215 0.0913 0.0884 0.0927 0.0886 0.0981 0.0931 0.1151 0.1211 0.1353 0.1405 0.1586 0.1574 0.1442 0.1533 0.1571 0.1582 0.1576
va: 2.1102 2.0334 2.0596 3.7103 3.7625 3.8529 3.9057 3.9067 3.8509 4.1498 3.7702 3.9250 3.9403 3.8072 3.6055 4.0245 3.9735 3.7449 3.8918 3.9520 3.6505 3.9975 3.8639 3.8987 3.9209 3.9048 1.0038 1.0294 1.0031 1.0053 1.0014 1.0012 1.0039 1.0105 1.0263 0.9957 1.0090 0.9965 1.0127 0.9964 0.9977 1.0099 0.9921 1.0249 1.0028 0.9899 0.9954 1.0092 0.9990 0.9891 0.9913 0.9903
dispcorr: -0.025748121 hartree
energy: -1117.892163705927
dipole: -19.66066 19.25517 -0.40549 -13.73655 13.41288 -0.32367 15.82661 -16.04605 -0.21944
magnitude: 0.56332 au
magnitude: 1.43185 debye
