program: Gaussian 09
title: 000069469
version: EM64L-G09RevD.01
frameworkgroup: C1[X(C7H6O5S)]
method: RPBEPBE
basis: SDD
operation: Freq
keyword: #pfreq=noraman
keyword: PBEPBE/SDD
title: #p freq=noraman PBEPBE/SDD
converged: YES YES NO NO
title: Mulliken charges:
elementType: S O O O O O C C C C C C C H H H H H H
charge: 0.996835 -0.566214 -0.495852 -0.496459 -0.434831 -0.234044 -0.038244 -0.222201 -0.222335 0.268106 -0.324207 -0.298330 0.129787 0.290292 0.289595 0.287302 0.290199 0.386779 0.393822
chargesum: 0.00000
title: Mulliken charges with hydrogens summed into heavy atoms:
elementType: S O O O O O C C C C C C C
charge: 0.996835 -0.179435 -0.495852 -0.496459 -0.041009 -0.234044 -0.038244 0.068091 0.067260 0.268106 -0.036904 -0.008130 0.129787
polarizability: 1.74144751e+02 1.06097603e+00 1.15737496e+02 1.05022037e+00 2.76024145e-02 6.48338042e+01
1716.lowfreq: -7.8004 -5.8067 -0.0016 -0.0015 -0.0007 6.9748 31.0291 61.5611 72.6058
frequency: 30.9016 61.5582 72.6026 110.9421 148.8691 167.0427 201.5747 203.9604 270.8909 277.5145 336.5577 359.5433 374.1269 407.9511 460.7713 480.6541 492.2817 555.7212 600.5424 615.4762 616.1970 683.8566 746.7519 758.9941 835.6156 860.6746 875.6888 968.4669 991.7473 995.7996 1004.8080 1021.8587 1043.9948 1056.4949 1113.3637 1147.3973 1183.9343 1292.3540 1324.9249 1391.0766 1397.4529 1467.2754 1589.8376 1596.8059 1647.6997 3160.3178 3163.8047 3176.7667 3189.0743 3480.8692 3533.5275
redmass: 6.7138 7.5682 6.3114 9.1924 7.0918 1.6791 4.0771 9.1521 6.8582 3.6457 8.6883 9.6238 10.0226 2.8427 7.1562 3.8387 6.8792 9.5854 1.3037 7.0447 4.7578 3.5113 5.2129 3.9679 13.2296 1.2427 1.6159 17.4149 5.4227 1.4099 1.3822 4.5788 1.4033 1.7135 1.3421 1.7694 1.1771 1.2787 2.6444 4.5325 5.0067 2.3427 7.6984 6.3858 9.0864 1.0891 1.0907 1.0975 1.0963 1.0661 1.0643
irintensity: 1.7836 0.5036 1.2047 1.0069 0.8435 51.9602 13.2852 6.0154 14.4319 66.0147 5.1089 3.1578 77.2953 0.3199 9.5909 16.6673 8.6517 193.1514 55.6753 0.3098 82.0739 94.5828 18.3762 11.9939 77.5295 0.8419 48.7750 105.4302 49.6985 2.7393 0.1922 221.8884 39.5603 48.8701 2.4384 91.0822 6.2245 4.1567 93.9630 36.9076 9.5855 5.7736 12.7376 22.5006 251.3760 3.0555 2.7248 0.6061 0.1674 49.9359 59.6195
temp: 298.150 k
press: 1.00000 atm
elementType: 16 8 8 8 8 8 6 6 6 6 6 6 6 1 1 1 1 1 1
symmnumber: 1
zpe: 320281.7 jmol-1
zpe.correction: 0.121989 hartree
zpe.thermalcorrener: 0.134884 hartree
zpe.thermalcorrenthalpy: 0.135828 hartree
zpe.thermalcorrgfe: 0.081539 hartree
zpe.sumelectzpe: -1043.401903 hartree
zpe.sumelectthermal: -1043.389008 hartree
zpe.sumelectthermalent: -1043.388064 hartree
zpe.sumelectthermalfe: -1043.442353 hartree
dipole: 2.7974 -1.3112 1.4526
dipole: 3.4139
quadrupole: -80.7886 -83.2393 -85.6882
quadrupole: -8.8448 -9.3078 -0.1097
quadrupole: 2.4501 -0.0006 -2.4495 -8.8448 -9.3078 -0.1097
hfenergy: -1043.5238921 hartree
pointgroup: C01 [X(C7H6O5S1)]
dipole: -1.0929635 -0.5360503 -0.5675332 debye
dipolederiv: 2.0330756 0.0161134 -0.0814152 0.0245303 1.2206823 -0.0177034 -0.1827798 -0.0197554 1.648132 -0.5327596 -0.0056908 0.2328834 -0.0101599 -0.5503125 0.0235715 0.3031135 0.0237789 -0.9946748 -0.7114508 -0.0507624 -0.0184468 -0.0827046 -0.5740473 -0.1179125 -0.0039573 -0.0340206 -0.5125548 -0.7168733 0.0481748 -0.0192243 0.0767101 -0.5823794 0.1109063 0.0001544 0.0285779 -0.500895 -0.7234531 -0.4477837 -0.0100988 -0.5800905 -0.9833367 -0.0162427 -0.0182316 -0.0189911 -0.4220255 -0.9830048 0.2686578 0.0082941 0.1501598 -0.7793043 -0.0127637 -0.0000156 -0.0108732 -0.3213499 0.0148462 0.0013994 -0.0195031 0.0099429 0.0225927 0.0037526 -0.1572393 0.0005597 -0.1371024 -0.251711 0.2215531 0.0140439 -0.137953 -0.0503315 -0.0001263 0.0087842 0.0166469 -0.0794168 -0.2711724 -0.2275216 0.001212 0.1230022 -0.0548091 0.0016702 0.0167785 -0.0137461 -0.0824328 -0.5408643 -0.0334355 -0.0004895 -0.0081808 0.0172113 -0.000116 -0.006361 -0.0002122 0.0239033 0.0247245 -0.1966956 -0.0022559 0.141984 0.0043664 0.0025784 0.0223759 0.0001504 -0.0915294 0.0471475 0.2020471 0.0087133 -0.1274013 -0.0030504 0.0027519 0.0152963 0.0054682 -0.0921881 1.9401912 0.1026288 0.0039682 0.2740542 1.3972176 0.032455 0.0187521 0.0329968 0.2408109 0.1116157 -0.0569752 -0.0098171 -0.0336987 0.0793094 0.0004531 -0.0065163 -0.0111608 0.1575931 0.1084148 0.0592491 -0.0065023 0.0362195 0.0814122 -0.0049081 -0.0050647 0.0063635 0.1573717 0.068519 0.0587871 0.0017859 0.0234705 0.05053 -0.0037433 -0.0057559 -0.0038353 0.1620023 0.0772369 -0.0421629 -0.0011125 -0.0362365 0.0420223 -0.0027298 -0.0073399 -0.0027623 0.1646686 0.1048761 -0.0033525 -0.1027569 -0.0075217 0.3553459 0.0005991 0.0049994 0.0029529 0.2726655 0.2006417 0.0857694 0.0007217 0.1638735 0.3068812 -0.0024925 0.0030072 -0.0021383 0.4070221 unknown
polarizability: 174.1560294|0.852661|115.6930866|-0.8057099|1.3708855|64.8669351 unknown
InChI: InChI=1S/C7H6O5S/c8-7(9)5-1-3-6(4-2-5)13(10,11)12/h1-4,8,10H
charge 0 multiplicity 1
19 atoms
S  2.860985 0.100572 0.075751
O  3.057231 0.178342 -1.768366
O  3.381276 1.492366 0.713471
O  3.435277 -1.316777 0.602077
O  -3.823904 -1.256479 -0.023931
O  -3.984347 1.061135 0.03977
C  0.983256 0.064546 0.040627
C  0.304728 1.293583 0.072958
C  0.355158 -1.190105 0.004261
C  -1.78072 0.007881 0.023957
C  -1.104109 1.254381 0.066051
C  -1.055357 -1.210744 -0.001975
C  -3.27352 0.029882 0.015647
H  0.856051 2.237605 0.11607
H  0.945837 -2.111052 -0.004607
H  -1.6939 2.175804 0.089988
H  -1.598266 -2.158633 -0.029488
H  4.037587 0.214754 -1.970589
H  -4.816262 -1.189259 -0.028573
