program: Orca
programVersion: 5.0.2
elementType: O O O C C C C C C C C C C C C C C C C C C C C C C C H H H H H H H H H H H H H H H H H H H H H H H H H H
charge: 0
multiplicity: 1
keywords: wb97x-d3
keywords: def2-TZVPP
keywords: def2/J RIJCOSX
keywords: DEFGRID2
keywords: scfconv7
keywords: smallprint printgap noloewdin
keywords: NOSOSCF
formula: C23H26O3
InChI: InChI=1/C23H26O3/c1-16(2)13-20-21(23(20,3)4)22(24)25-15-17-9-8-12-19(14-17)26-18-10-6-5-7-11-18/h5-14,20-21H,15H2,1-4H3
52 atoms
O  -2.311401 1.928137 -0.585528
O  -2.412058 0.077013 -1.841831
O  2.575211 -0.005061 -0.837778
C  -4.501133 -0.97558 0.18636
C  -3.189771 -1.244868 0.836394
C  -3.501897 0.15934 0.292039
C  -5.699583 -0.830765 1.096211
C  -4.855398 -1.609397 -1.136816
C  -2.142865 -2.098368 0.228503
C  -2.708626 0.675117 -0.834648
C  -0.856627 -2.047571 0.585663
C  0.170025 -2.939725 -0.037981
C  -0.355967 -1.066124 1.607865
C  -1.462107 2.597541 -1.524791
C  -0.021995 2.510614 -1.10311
C  0.647771 1.289757 -1.127674
C  0.652863 3.646601 -0.67205
C  1.971926 1.215524 -0.728065
C  1.985658 3.56422 -0.289511
C  2.657623 2.353284 -0.31744
C  3.411643 -0.487146 0.126904
C  4.342999 -1.429412 -0.292843
C  3.322258 -0.13371 1.468251
C  5.189292 -2.017104 0.634235
C  4.184348 -0.724291 2.382736
C  5.119317 -1.665259 1.975714
H  -3.20214 -1.259365 1.923729
H  -3.7218 0.903344 1.04871
H  -6.465039 -0.200088 0.639395
H  -5.433944 -0.386474 2.056587
H  -6.14932 -1.805462 1.296792
H  -5.317481 -2.582715 -0.958971
H  -4.009759 -1.765545 -1.799286
H  -5.583884 -0.996541 -1.671267
H  -2.44851 -2.811983 -0.530193
H  0.938632 -2.35079 -0.545737
H  -0.264875 -3.624111 -0.766717
H  0.689484 -3.534051 0.718458
H  -0.947138 -1.091528 2.526002
H  -0.402365 -0.039323 1.235027
H  0.679792 -1.265637 1.881976
H  -1.791339 3.636198 -1.528675
H  -1.604627 2.198737 -2.529815
H  0.151276 0.390656 -1.4714
H  0.140487 4.60029 -0.640544
H  2.510462 4.454137 0.032962
H  3.699323 2.301151 -0.027139
H  4.396476 -1.702039 -1.339607
H  2.591828 0.587589 1.810857
H  5.91086 -2.752286 0.301612
H  4.113878 -0.444839 3.426166
H  5.78513 -2.121544 2.696295
elementType: O C H
totalener: -1117.86397565 hartree
nucrepener: 2327.83311488 hartree
electener: -3445.69709053 hartree
oneelecener: -6145.56214099 hartree
twoeener: 2699.86505046 hartree
cpcmener: -0.02364960 hartree
kineticenergy: 1112.80249384 hartree
xcener: -110.228509020289 hartree
chargesum: -0.0000000
charge: -0.290811 -0.468726 -0.323462 0.131685 -0.032583 -0.106430 -0.264404 -0.295775 -0.240926 0.397404 -0.022786 -0.221067 -0.298946 0.080987 0.030801 -0.284121 -0.215599 0.290993 -0.118706 -0.222871 0.346255 -0.274191 -0.250351 -0.102717 -0.140893 -0.197765 0.112202 0.089924 0.095851 0.086053 0.094233 0.098655 0.093662 0.098705 0.122316 0.085606 0.092553 0.101179 0.113936 0.096538 0.103415 0.110975 0.116921 0.150542 0.141905 0.159163 0.154414 0.143505 0.160019 0.156769 0.158549 0.157417
qa: -0.2908 -0.4687 -0.3235 0.1317 -0.0326 -0.1064 -0.2644 -0.2958 -0.2409 0.3974 -0.0228 -0.2211 -0.2989 0.0810 0.0308 -0.2841 -0.2156 0.2910 -0.1187 -0.2229 0.3463 -0.2742 -0.2504 -0.1027 -0.1409 -0.1978 0.1122 0.0899 0.0959 0.0861 0.0942 0.0987 0.0937 0.0987 0.1223 0.0856 0.0926 0.1012 0.1139 0.0965 0.1034 0.1110 0.1169 0.1505 0.1419 0.1592 0.1544 0.1435 0.1600 0.1568 0.1585 0.1574
va: 2.1095 2.0178 2.0445 3.7712 3.8055 3.8538 3.8975 3.8921 3.7934 4.1047 3.6607 3.9132 3.9506 3.8168 3.6903 3.9555 3.9829 3.7477 3.8890 3.9485 3.5389 4.0157 3.8893 3.8686 3.9150 3.9191 1.0049 1.0340 1.0028 1.0048 1.0024 0.9984 1.0192 1.0006 1.0015 1.0002 1.0114 0.9945 1.0038 0.9978 1.0029 0.9998 1.0166 1.0273 1.0038 0.9895 0.9978 1.0104 0.9963 0.9890 0.9903 0.9908
dispcorr: -0.028870720 hartree
energy: -1117.892846367297
dipole: -14.94244 15.08932 0.14688 -11.27020 12.05478 0.78458 7.54033 -6.23715 1.30318
magnitude: 1.52821 au
magnitude: 3.88440 debye
