program: Orca
programVersion: 5.0.2
elementType: O O O C C C C C C C C C C C C C C C C C C C C C C C H H H H H H H H H H H H H H H H H H H H H H H H H H
charge: 0
multiplicity: 1
keywords: wb97x-d3
keywords: def2-TZVPP
keywords: def2/J RIJCOSX
keywords: DEFGRID2
keywords: scfconv7
keywords: smallprint printgap noloewdin
keywords: NOSOSCF
formula: C23H26O3
InChI: InChI=1/C23H26O3/c1-16(2)13-20-21(23(20,3)4)22(24)25-15-17-9-8-12-19(14-17)26-18-10-6-5-7-11-18/h5-14,20-21H,15H2,1-4H3
52 atoms
O  -1.739454 1.772217 -0.507115
O  -0.978516 0.685428 1.29308
O  2.861971 0.447082 -2.163211
C  -2.053053 -1.801552 -0.34456
C  -3.089473 -1.477525 0.674094
C  -2.539676 -0.36486 -0.208865
C  -2.490363 -2.505411 -1.606597
C  -0.657573 -2.176795 0.08579
C  -2.828815 -1.58323 2.132905
C  -1.673936 0.70687 0.307409
C  -3.393993 -0.827562 3.076375
C  -3.117965 -1.059416 4.53035
C  -4.318419 0.310693 2.775399
C  -0.944174 2.907231 -0.206298
C  0.477834 2.794762 -0.691919
C  1.005072 1.62629 -1.220315
C  1.286294 3.928301 -0.605101
C  2.334693 1.592696 -1.625887
C  2.600129 3.887825 -1.037172
C  3.141385 2.712689 -1.543583
C  2.845597 -0.700575 -1.42014
C  2.905039 -0.696862 -0.031067
C  2.813055 -1.899959 -2.121306
C  2.930866 -1.906447 0.649372
C  2.845949 -3.099828 -1.426498
C  2.90139 -3.111008 -0.038998
H  -4.105639 -1.739373 0.387737
H  -3.201322 -0.036289 -1.001959
H  -1.824714 -2.267259 -2.438786
H  -3.503333 -2.227491 -1.90114
H  -2.471381 -3.5886 -1.468098
H  -0.599495 -3.255536 0.24489
H  -0.335927 -1.693823 1.004521
H  0.062477 -1.925148 -0.695419
H  -2.157209 -2.37814 2.445594
H  -2.424978 -1.885251 4.691846
H  -4.039492 -1.282166 5.075105
H  -2.692634 -0.166574 4.996557
H  -5.274536 0.181986 3.289763
H  -4.526268 0.428632 1.713308
H  -3.898017 1.252136 3.140055
H  -0.957963 3.121785 0.865334
H  -1.436619 3.741667 -0.706816
H  0.405358 0.732024 -1.336572
H  0.880171 4.848632 -0.201932
H  3.216688 4.774888 -0.971786
H  4.17211 2.668767 -1.87161
H  2.936414 0.232134 0.523821
H  2.76599 -1.889607 -3.203245
H  2.975996 -1.90062 1.730944
H  2.819489 -4.031701 -1.976737
H  2.920185 -4.048748 0.500515
elementType: O C H
totalener: -1117.86638548 hartree
nucrepener: 2344.24211774 hartree
electener: -3462.10850322 hartree
oneelecener: -6178.70789031 hartree
twoeener: 2716.59938709 hartree
cpcmener: -0.02639101 hartree
kineticenergy: 1112.79908179 hartree
xcener: -110.230033977323 hartree
chargesum: -0.0000000
charge: -0.295416 -0.449562 -0.331908 0.171308 -0.017801 -0.096074 -0.266132 -0.319070 -0.276569 0.348034 -0.021614 -0.225037 -0.266451 0.082456 0.018911 -0.181320 -0.218176 0.221609 -0.128968 -0.214996 0.266055 -0.167800 -0.218656 -0.172309 -0.131692 -0.179158 0.115369 0.095806 0.096030 0.087621 0.093893 0.109137 0.103448 0.069878 0.121866 0.088604 0.094541 0.093538 0.105112 0.092883 0.098572 0.116914 0.127602 0.153638 0.141790 0.157046 0.146372 0.149992 0.142832 0.157482 0.155076 0.155297
qa: -0.2954 -0.4496 -0.3319 0.1713 -0.0178 -0.0961 -0.2661 -0.3191 -0.2766 0.3480 -0.0216 -0.2250 -0.2665 0.0825 0.0189 -0.1813 -0.2182 0.2216 -0.1290 -0.2150 0.2661 -0.1678 -0.2187 -0.1723 -0.1317 -0.1792 0.1154 0.0958 0.0960 0.0876 0.0939 0.1091 0.1034 0.0699 0.1219 0.0886 0.0945 0.0935 0.1051 0.0929 0.0986 0.1169 0.1276 0.1536 0.1418 0.1570 0.1464 0.1500 0.1428 0.1575 0.1551 0.1553
va: 2.1109 2.0292 2.0704 3.7320 3.8619 3.8287 3.8972 3.8993 3.8569 4.1220 3.7067 3.9265 3.9427 3.8449 3.6571 3.9446 3.9632 3.7875 3.8847 3.9935 3.6920 3.8324 3.9572 3.8638 3.8833 3.8556 1.0020 1.0307 1.0013 1.0055 1.0020 1.0003 1.0085 1.0104 1.0008 1.0074 0.9965 0.9968 0.9997 1.0059 0.9982 1.0108 0.9920 0.9919 1.0001 0.9894 1.0046 1.0021 1.0091 0.9925 0.9899 0.9917
dispcorr: -0.028390507 hartree
energy: -1117.894775985153
dipole: -18.59268 17.68196 -0.91073 -11.60394 11.80774 0.20381 12.56963 -12.68550 -0.11588
magnitude: 0.94042 au
magnitude: 2.39036 debye
