program: Orca
programVersion: 5.0.2
elementType: O O O C C C C C C C C C C C C C C C C C C C C C C C H H H H H H H H H H H H H H H H H H H H H H H H H H
charge: 0
multiplicity: 1
keywords: wb97x-d3
keywords: def2-TZVPP
keywords: def2/J RIJCOSX
keywords: DEFGRID2
keywords: scfconv7
keywords: smallprint printgap noloewdin
keywords: NOSOSCF
formula: C23H26O3
InChI: InChI=1/C23H26O3/c1-16(2)13-20-21(23(20,3)4)22(24)25-15-17-9-8-12-19(14-17)26-18-10-6-5-7-11-18/h5-14,20-21H,15H2,1-4H3
52 atoms
O  -1.24953 1.13298 -1.496553
O  -1.487457 1.43615 0.699718
O  3.886302 0.679978 -1.104806
C  -1.72855 -1.691909 0.724865
C  -3.143216 -1.20402 0.662277
C  -2.104741 -0.655166 -0.318195
C  -1.450994 -3.068457 0.16829
C  -0.83873 -1.34045 1.891416
C  -3.762889 -0.387623 1.722292
C  -1.598684 0.727128 -0.27157
C  -5.027203 -0.482454 2.151195
C  -5.518423 0.403219 3.258179
C  -6.063162 -1.423722 1.61602
C  -0.674675 2.433578 -1.620674
C  0.710395 2.508335 -1.040278
C  1.642041 1.516803 -1.329168
C  1.077632 3.586924 -0.243733
C  2.925708 1.608923 -0.809039
C  2.370451 3.678822 0.250788
C  3.300076 2.686447 -0.019265
C  3.599763 -0.653083 -1.007548
C  4.212227 -1.498206 -1.923388
C  2.780829 -1.167605 -0.009142
C  4.002962 -2.867047 -1.837347
C  2.575285 -2.53824 0.059414
C  3.17963 -3.393947 -0.851628
H  -3.822082 -1.887966 0.165341
H  -2.194744 -1.042046 -1.326655
H  -0.425095 -3.141537 -0.199708
H  -2.117513 -3.316331 -0.658886
H  -1.582809 -3.830159 0.939676
H  0.20713 -1.307103 1.580125
H  -0.925528 -2.112943 2.658166
H  -1.069411 -0.389776 2.362966
H  -3.135242 0.348104 2.209121
H  -5.836571 -0.187417 4.121807
H  -6.392115 0.980439 2.943012
H  -4.756319 1.105743 3.59541
H  -6.521269 -1.990694 2.43001
H  -5.685097 -2.141687 0.891796
H  -6.874486 -0.869085 1.13762
H  -1.323395 3.189793 -1.174106
H  -0.647525 2.616799 -2.695304
H  1.371862 0.678248 -1.960758
H  0.352064 4.355905 -0.00932
H  2.653676 4.520263 0.869736
H  4.306612 2.745256 0.375342
H  4.850984 -1.08546 -2.694391
H  2.310774 -0.514555 0.715813
H  4.482689 -3.522623 -2.55284
H  1.93988 -2.937353 0.839934
H  3.013657 -4.461374 -0.790308
elementType: O C H
totalener: -1117.86678049 hartree
nucrepener: 2288.56541480 hartree
electener: -3406.43219529 hartree
oneelecener: -6066.87445676 hartree
twoeener: 2660.44226147 hartree
cpcmener: -0.02566931 hartree
kineticenergy: 1112.80485577 hartree
xcener: -110.229555141668 hartree
chargesum: 0.0000000
charge: -0.294702 -0.464583 -0.332616 0.117992 0.023813 -0.073016 -0.268059 -0.282061 -0.295099 0.384864 -0.059229 -0.218627 -0.256686 0.102564 0.035648 -0.223533 -0.214726 0.250360 -0.117632 -0.242593 0.276213 -0.249689 -0.169336 -0.119745 -0.172350 -0.190288 0.116956 0.094951 0.090732 0.088449 0.095888 0.077625 0.103318 0.102116 0.119966 0.092879 0.091380 0.088201 0.093325 0.088091 0.098766 0.113886 0.121269 0.140876 0.141065 0.157250 0.146686 0.145326 0.160154 0.157497 0.169498 0.156965
qa: -0.2947 -0.4646 -0.3326 0.1180 0.0238 -0.0730 -0.2681 -0.2821 -0.2951 0.3849 -0.0592 -0.2186 -0.2567 0.1026 0.0356 -0.2235 -0.2147 0.2504 -0.1176 -0.2426 0.2762 -0.2497 -0.1693 -0.1197 -0.1723 -0.1903 0.1170 0.0950 0.0907 0.0884 0.0959 0.0776 0.1033 0.1021 0.1200 0.0929 0.0914 0.0882 0.0933 0.0881 0.0988 0.1139 0.1213 0.1409 0.1411 0.1572 0.1467 0.1453 0.1602 0.1575 0.1695 0.1570
va: 2.1127 2.0297 2.0712 3.6819 3.7521 3.8295 3.9140 3.9079 3.8571 4.1173 3.7870 3.9226 3.9396 3.8032 3.6160 3.9352 3.9619 3.7331 3.8944 4.0145 3.7261 4.0048 3.8615 3.8940 3.8775 3.9242 1.0025 1.0302 1.0037 1.0074 1.0006 1.0094 1.0012 1.0170 1.0264 0.9965 0.9960 1.0093 0.9974 1.0139 0.9961 1.0096 0.9923 1.0168 1.0039 0.9893 1.0057 1.0081 0.9944 0.9884 0.9806 0.9921
dispcorr: -0.026055711 hartree
energy: -1117.892836197045
dipole: -25.79981 25.10808 -0.69173 -13.20029 12.38957 -0.81072 13.02238 -13.52179 -0.49941
magnitude: 1.17693 au
magnitude: 2.99151 debye
