program: Orca
programVersion: 5.0.2
elementType: O O O C C C C C C C C C C C C C C C C C C C C C C C H H H H H H H H H H H H H H H H H H H H H H H H H H
charge: 0
multiplicity: 1
keywords: wb97x-d3
keywords: def2-TZVPP
keywords: def2/J RIJCOSX
keywords: DEFGRID2
keywords: scfconv7
keywords: smallprint printgap noloewdin
keywords: NOSOSCF
formula: C23H26O3
InChI: InChI=1/C23H26O3/c1-16(2)13-20-21(23(20,3)4)22(24)25-15-17-9-8-12-19(14-17)26-18-10-6-5-7-11-18/h5-14,20-21H,15H2,1-4H3
52 atoms
O  -1.878094 2.014646 -0.005282
O  -2.090984 0.574387 -1.702163
O  3.095499 1.039238 -0.290116
C  -3.340298 -1.366097 0.38876
C  -1.872126 -1.535421 0.634201
C  -2.480515 -0.133308 0.566368
C  -4.267375 -1.660736 1.544001
C  -3.92932 -1.739706 -0.948587
C  -0.944075 -2.05981 -0.392198
C  -2.14696 0.806766 -0.518717
C  -0.296122 -3.227264 -0.312279
C  0.608028 -3.680313 -1.418423
C  -0.418819 -4.192281 0.826989
C  -1.400275 3.039542 -0.864885
C  0.103907 3.06079 -0.956521
C  0.88684 1.988914 -0.548801
C  0.714782 4.199911 -1.47433
C  2.271935 2.067467 -0.645619
C  2.094772 4.25867 -1.582107
C  2.884934 3.198838 -1.163463
C  2.711947 0.108901 0.638048
C  2.987424 -1.220276 0.351521
C  2.133313 0.467068 1.850438
C  2.680919 -2.198389 1.287117
C  1.811097 -0.523766 2.765984
C  2.081894 -1.858104 2.491309
H  -1.616974 -1.808789 1.65313
H  -2.570624 0.352169 1.531121
H  -4.506448 -2.725618 1.581981
H  -5.207176 -1.113626 1.442104
H  -3.825815 -1.386651 2.503271
H  -4.259632 -2.780097 -0.914454
H  -3.235567 -1.648617 -1.779302
H  -4.804887 -1.127895 -1.174464
H  -0.790599 -1.46682 -1.286223
H  0.264149 -4.628615 -1.841239
H  1.622082 -3.859223 -1.051031
H  0.6669 -2.954032 -2.229112
H  -0.977906 -5.07949 0.515561
H  -0.923922 -3.781569 1.699686
H  0.564114 -4.547216 1.145269
H  -1.753294 3.9744 -0.428678
H  -1.843395 2.959261 -1.859982
H  0.438516 1.092028 -0.14395
H  0.110823 5.042756 -1.788769
H  2.566258 5.14644 -1.983396
H  3.964061 3.247548 -1.236282
H  3.44472 -1.484639 -0.59386
H  1.932933 1.50528 2.083752
H  2.903495 -3.234055 1.064615
H  1.353425 -0.244964 3.706499
H  1.833759 -2.624625 3.213566
elementType: O C H
totalener: -1117.86579435 hartree
nucrepener: 2371.61089800 hartree
electener: -3489.47669235 hartree
oneelecener: -6233.15217227 hartree
twoeener: 2743.67547992 hartree
cpcmener: -0.02589142 hartree
kineticenergy: 1112.79041577 hartree
xcener: -110.230918568216 hartree
chargesum: 0.0000000
charge: -0.290572 -0.457782 -0.324875 0.174606 -0.022105 -0.121432 -0.265606 -0.292248 -0.288299 0.369923 -0.032665 -0.233217 -0.272685 0.083597 0.024763 -0.211849 -0.249250 0.321477 -0.103717 -0.267097 0.320393 -0.270205 -0.203863 -0.109859 -0.138935 -0.194820 0.110806 0.097544 0.093830 0.094338 0.087214 0.094022 0.098319 0.102336 0.128123 0.106012 0.084109 0.093435 0.113773 0.092895 0.088698 0.125206 0.115123 0.115125 0.140985 0.155404 0.143699 0.144072 0.155624 0.161160 0.157931 0.156540
qa: -0.2906 -0.4578 -0.3249 0.1746 -0.0221 -0.1214 -0.2656 -0.2922 -0.2883 0.3699 -0.0327 -0.2332 -0.2727 0.0836 0.0248 -0.2118 -0.2493 0.3215 -0.1037 -0.2671 0.3204 -0.2702 -0.2039 -0.1099 -0.1389 -0.1948 0.1108 0.0975 0.0938 0.0943 0.0872 0.0940 0.0983 0.1023 0.1281 0.1060 0.0841 0.0934 0.1138 0.0929 0.0887 0.1252 0.1151 0.1151 0.1410 0.1554 0.1437 0.1441 0.1556 0.1612 0.1579 0.1565
va: 2.1194 2.0304 2.0920 3.7202 3.7704 3.9464 3.8989 3.9070 3.7707 4.1309 3.7339 3.9143 3.9338 3.8446 3.6695 3.9270 3.9790 3.7138 3.8893 3.9994 3.6543 3.9843 3.9062 3.8002 3.8710 3.8783 1.0026 1.0300 1.0025 1.0024 1.0047 1.0020 1.0139 1.0004 1.0200 0.9983 0.9975 1.0066 0.9993 1.0075 0.9985 0.9922 1.0132 1.0100 1.0011 0.9893 1.0095 1.0100 0.9957 0.9839 0.9902 0.9924
dispcorr: -0.029262309 hartree
energy: -1117.895056661742
dipole: -14.16243 13.65939 -0.50303 -22.26744 22.10440 -0.16304 3.41324 -2.15274 1.26050
magnitude: 1.36692 au
magnitude: 3.47445 debye
