program: Orca
programVersion: 5.0.2
elementType: O O O C C C C C C C C C C C C C C C C C C C C C C C H H H H H H H H H H H H H H H H H H H H H H H H H H
charge: 0
multiplicity: 1
keywords: wb97x-d3
keywords: def2-TZVPP
keywords: def2/J RIJCOSX
keywords: DEFGRID2
keywords: scfconv7
keywords: smallprint printgap noloewdin
keywords: NOSOSCF
formula: C23H26O3
InChI: InChI=1/C23H26O3/c1-16(2)13-20-21(23(20,3)4)22(24)25-15-17-9-8-12-19(14-17)26-18-10-6-5-7-11-18/h5-14,20-21H,15H2,1-4H3
52 atoms
O  -1.725802 1.826963 -0.743143
O  -1.034429 1.019969 1.221201
O  2.887103 0.440848 -2.23001
C  -1.893604 -1.708639 -0.107533
C  -3.030519 -1.305285 0.775732
C  -2.447823 -0.296264 -0.214289
C  -2.220335 -2.607078 -1.277508
C  -0.514842 -1.95991 0.450058
C  -2.91486 -1.169818 2.239984
C  -1.667902 0.879917 0.203219
C  -3.914934 -1.302263 3.119726
C  -3.654709 -1.177593 4.591597
C  -5.348365 -1.570113 2.774811
C  -0.96777 3.011781 -0.554457
C  0.491487 2.850431 -0.892172
C  1.020421 1.670234 -1.392863
C  1.326777 3.955085 -0.72784
C  2.372277 1.601668 -1.709154
C  2.666569 3.878441 -1.066187
C  3.205223 2.694364 -1.555052
C  2.932117 -0.66793 -1.432176
C  3.078148 -0.593531 -0.051793
C  2.868017 -1.901863 -2.06878
C  3.16604 -1.76702 0.685079
C  2.960705 -3.064501 -1.318563
C  3.108249 -3.0051 0.061199
H  -3.995317 -1.663324 0.434448
H  -3.059603 -0.116497 -1.090651
H  -2.190145 -3.65608 -0.974986
H  -1.498319 -2.475035 -2.086248
H  -3.213852 -2.40813 -1.681404
H  0.236939 -1.800829 -0.325516
H  -0.435413 -2.99984 0.773388
H  -0.248905 -1.335177 1.297736
H  -1.928982 -0.971218 2.642275
H  -2.610813 -0.95277 4.810516
H  -3.916764 -2.100679 5.11623
H  -4.268856 -0.388307 5.033874
H  -5.533313 -1.724301 1.713718
H  -5.980827 -0.73888 3.09883
H  -5.711572 -2.454368 3.30517
H  -1.081244 3.392937 0.463281
H  -1.419211 3.7447 -1.224392
H  0.402494 0.797047 -1.564094
H  0.92198 4.882588 -0.340094
H  3.304374 4.743638 -0.939991
H  4.254405 2.623255 -1.8122
H  3.131833 0.362572 0.453348
H  2.751228 -1.94736 -3.144556
H  3.28261 -1.70565 1.75959
H  2.910463 -4.022943 -1.819406
H  3.177554 -3.914428 0.643462
elementType: O C H
totalener: -1117.86766774 hartree
nucrepener: 2311.74417659 hartree
electener: -3429.61184432 hartree
oneelecener: -6113.54817616 hartree
twoeener: 2683.93633183 hartree
cpcmener: -0.02611523 hartree
kineticenergy: 1112.79035610 hartree
xcener: -110.228709546808 hartree
chargesum: 0.0000000
charge: -0.295887 -0.456944 -0.333724 0.141447 0.016040 -0.069998 -0.263223 -0.284689 -0.286838 0.355352 -0.054223 -0.219917 -0.255622 0.081314 0.016267 -0.166910 -0.215525 0.205269 -0.129769 -0.205235 0.263289 -0.172629 -0.216179 -0.166312 -0.127318 -0.187737 0.116752 0.096119 0.095272 0.093593 0.088686 0.055545 0.107071 0.103335 0.117681 0.088226 0.092866 0.091682 0.087942 0.097284 0.094352 0.117741 0.130886 0.145099 0.142402 0.157753 0.147320 0.150248 0.143289 0.157062 0.155806 0.155687
qa: -0.2959 -0.4569 -0.3337 0.1414 0.0160 -0.0700 -0.2632 -0.2847 -0.2868 0.3554 -0.0542 -0.2199 -0.2556 0.0813 0.0163 -0.1669 -0.2155 0.2053 -0.1298 -0.2052 0.2633 -0.1726 -0.2162 -0.1663 -0.1273 -0.1877 0.1168 0.0961 0.0953 0.0936 0.0887 0.0555 0.1071 0.1033 0.1177 0.0882 0.0929 0.0917 0.0879 0.0973 0.0944 0.1177 0.1309 0.1451 0.1424 0.1578 0.1473 0.1502 0.1433 0.1571 0.1558 0.1557
va: 2.1149 2.0294 2.0621 3.7243 3.7801 3.8168 3.9012 3.8922 3.8537 4.1324 3.7868 3.9229 3.9389 3.8275 3.6529 3.9581 3.9675 3.7971 3.8805 3.9875 3.6959 3.8363 3.9586 3.8683 3.8821 3.8691 1.0005 1.0302 1.0015 1.0021 1.0059 1.0146 1.0022 1.0146 1.0203 1.0091 0.9963 0.9964 1.0138 0.9968 0.9969 1.0125 0.9909 1.0052 0.9998 0.9892 1.0036 1.0022 1.0090 0.9922 0.9894 0.9918
dispcorr: -0.026989349 hartree
energy: -1117.894657084823
dipole: -20.37704 19.51156 -0.86548 -15.24764 15.19068 -0.05695 14.10326 -14.30978 -0.20652
magnitude: 0.89160 au
magnitude: 2.26627 debye
