program: Orca
programVersion: 5.0.2
elementType: O O O C C C C C C C C C C C C C C C C C C C C C C C H H H H H H H H H H H H H H H H H H H H H H H H H H
charge: 0
multiplicity: 1
keywords: wb97x-d3
keywords: def2-TZVPP
keywords: def2/J RIJCOSX
keywords: DEFGRID2
keywords: scfconv7
keywords: smallprint printgap noloewdin
keywords: NOSOSCF
formula: C23H26O3
InChI: InChI=1/C23H26O3/c1-16(2)13-20-21(23(20,3)4)22(24)25-15-17-9-8-12-19(14-17)26-18-10-6-5-7-11-18/h5-14,20-21H,15H2,1-4H3
52 atoms
O  -2.065388 1.584849 -0.35318
O  -3.321062 3.318889 0.261575
O  2.598484 -0.268289 0.614721
C  -4.491062 -0.149243 0.121012
C  -3.669307 -0.213733 1.367216
C  -4.067653 1.143758 0.80544
C  -5.960689 -0.475748 0.251258
C  -3.926487 -0.548732 -1.221394
C  -2.255833 -0.668516 1.440814
C  -3.130993 2.123476 0.220586
C  -1.822968 -1.905095 1.184882
C  -0.375296 -2.261844 1.338245
C  -2.706547 -3.026389 0.733107
C  -1.079844 2.445006 -0.937372
C  0.101372 1.576413 -1.250548
C  0.868337 1.072066 -0.205503
C  0.425486 1.246522 -2.560089
C  1.940237 0.233792 -0.469561
C  1.505995 0.41242 -2.815163
C  2.265637 -0.106572 -1.778656
C  3.923561 -0.602087 0.531368
C  4.866152 0.27904 0.015882
C  4.306099 -1.83255 1.043874
C  6.202961 -0.089615 0.010195
C  5.649043 -2.183016 1.043424
C  6.600726 -1.317852 0.522452
H  -4.24107 -0.449331 2.263135
H  -4.85964 1.65141 1.34414
H  -6.542772 0.011081 -0.534167
H  -6.368574 -0.158532 1.211884
H  -6.122233 -1.552513 0.162396
H  -4.295313 0.11125 -2.00948
H  -4.261477 -1.557904 -1.467356
H  -2.841239 -0.549531 -1.263475
H  -1.532507 0.057559 1.799439
H  0.21687 -1.427684 1.712371
H  0.052859 -2.579851 0.383587
H  -0.246726 -3.100386 2.027813
H  -3.756874 -2.749575 0.668171
H  -2.629197 -3.870945 1.423179
H  -2.393769 -3.402284 -0.244435
H  -0.806414 3.23718 -0.237747
H  -1.479023 2.91073 -1.840663
H  0.633589 1.328889 0.82135
H  -0.16564 1.635076 -3.379981
H  1.755674 0.150139 -3.835019
H  3.093653 -0.769296 -1.995114
H  4.565303 1.243731 -0.373705
H  3.558211 -2.505294 1.445106
H  6.93894 0.594358 -0.392057
H  5.948471 -3.141184 1.447997
H  7.646362 -1.595735 0.518897
elementType: O C H
totalener: -1117.86355335 hartree
nucrepener: 2283.45775415 hartree
electener: -3401.32130750 hartree
oneelecener: -6056.24001743 hartree
twoeener: 2654.91870993 hartree
cpcmener: -0.02639353 hartree
kineticenergy: 1112.81541861 hartree
xcener: -110.228950217786 hartree
chargesum: 0.0000000
charge: -0.257693 -0.478164 -0.325807 0.085286 -0.003511 -0.088909 -0.272316 -0.285074 -0.267912 0.392517 -0.002326 -0.246789 -0.266523 0.067518 0.020368 -0.317502 -0.184442 0.294331 -0.140762 -0.190242 0.260068 -0.186923 -0.236124 -0.146913 -0.127259 -0.176521 0.113018 0.091110 0.098418 0.086780 0.089547 0.113590 0.091795 0.093025 0.115756 0.081934 0.096557 0.104791 0.091284 0.107287 0.100571 0.117249 0.112701 0.138135 0.142794 0.157644 0.154918 0.156444 0.151318 0.158883 0.158265 0.157810
qa: -0.2577 -0.4782 -0.3258 0.0853 -0.0035 -0.0889 -0.2723 -0.2851 -0.2679 0.3925 -0.0023 -0.2468 -0.2665 0.0675 0.0204 -0.3175 -0.1844 0.2943 -0.1408 -0.1902 0.2601 -0.1869 -0.2361 -0.1469 -0.1273 -0.1765 0.1130 0.0911 0.0984 0.0868 0.0895 0.1136 0.0918 0.0930 0.1158 0.0819 0.0966 0.1048 0.0913 0.1073 0.1006 0.1172 0.1127 0.1381 0.1428 0.1576 0.1549 0.1564 0.1513 0.1589 0.1583 0.1578
va: 2.1038 2.0304 2.0520 3.6962 3.7871 3.8650 3.9143 3.8862 3.8659 4.1382 3.6496 3.9304 3.9405 3.8167 3.7200 3.9886 3.9333 3.6710 3.9229 3.9214 3.7212 3.9329 3.9876 3.8973 3.8868 3.8984 1.0043 1.0273 1.0004 1.0060 1.0035 1.0016 0.9999 1.0093 1.0114 1.0126 0.9951 0.9992 1.0047 1.0005 0.9956 1.0020 1.0023 1.0201 1.0031 0.9910 0.9982 0.9971 1.0019 0.9903 0.9901 0.9905
dispcorr: -0.027849645 hartree
energy: -1117.891402993197
dipole: -16.99709 17.83825 0.84116 -15.34367 13.79535 -1.54832 -0.36452 -0.35267 -0.71718
magnitude: 1.90242 au
magnitude: 4.83556 debye
