program: Orca
programVersion: 5.0.2
elementType: O O O C C C C C C C C C C C C C C C C C C C C C C C H H H H H H H H H H H H H H H H H H H H H H H H H H
charge: 0
multiplicity: 1
keywords: wb97x-d3
keywords: def2-TZVPP
keywords: def2/J RIJCOSX
keywords: DEFGRID2
keywords: scfconv7
keywords: smallprint printgap noloewdin
keywords: NOSOSCF
formula: C23H26O3
InChI: InChI=1/C23H26O3/c1-16(2)13-20-21(23(20,3)4)22(24)25-15-17-9-8-12-19(14-17)26-18-10-6-5-7-11-18/h5-14,20-21H,15H2,1-4H3
52 atoms
O  -1.197264 0.503376 0.516604
O  -3.004736 1.062223 1.697098
O  3.550505 -0.928497 0.264795
C  -4.080994 -1.763925 0.92821
C  -4.487124 -0.87581 -0.194967
C  -3.032159 -0.87819 0.279073
C  -3.926991 -3.236545 0.627649
C  -4.571924 -1.501634 2.330303
C  -5.385223 0.290509 -0.001641
C  -2.457828 0.314623 0.921844
C  -5.325479 1.426828 -0.699291
C  -6.29625 2.541595 -0.459956
C  -4.281606 1.699271 -1.738692
C  -0.500727 1.627864 1.04569
C  0.93967 1.551337 0.633236
C  1.606986 0.334169 0.557823
C  1.637801 2.729524 0.390323
C  2.962846 0.303674 0.26167
C  2.994938 2.687092 0.10764
C  3.672522 1.479287 0.048053
C  4.617598 -1.210663 -0.542023
C  4.695816 -0.775832 -1.859874
C  5.60913 -2.020874 -0.005407
C  5.786674 -1.148545 -2.632135
C  6.686133 -2.397838 -0.794388
C  6.784747 -1.95875 -2.107371
H  -4.594662 -1.369964 -1.157698
H  -2.3389 -1.392842 -0.376124
H  -3.586619 -3.411443 -0.393969
H  -4.879915 -3.755536 0.751711
H  -3.205719 -3.701969 1.302625
H  -4.74102 -0.451803 2.551955
H  -3.860712 -1.885304 3.064502
H  -5.516747 -2.026226 2.488492
H  -6.163157 0.186624 0.749762
H  -6.856251 2.777812 -1.368744
H  -5.775409 3.458989 -0.172034
H  -7.013535 2.302148 0.325133
H  -4.735585 2.08422 -2.655212
H  -3.694325 0.821021 -2.001942
H  -3.587673 2.471684 -1.393508
H  -0.568926 1.634067 2.137216
H  -0.951458 2.555494 0.683339
H  1.089134 -0.599869 0.738577
H  1.123339 3.681917 0.429281
H  3.537084 3.607176 -0.068368
H  4.734336 1.464093 -0.160631
H  3.918557 -0.155327 -2.287787
H  5.531803 -2.358251 1.020772
H  5.84954 -0.804561 -3.656548
H  7.454841 -3.033669 -0.374164
H  7.62977 -2.248291 -2.718064
elementType: O C H
totalener: -1117.86665419 hartree
nucrepener: 2165.24641449 hartree
electener: -3283.11306868 hartree
oneelecener: -5820.13186529 hartree
twoeener: 2537.01879661 hartree
cpcmener: -0.02531534 hartree
kineticenergy: 1112.79870671 hartree
xcener: -110.226920244910 hartree
chargesum: -0.0000000
charge: -0.290530 -0.466378 -0.326084 0.131202 -0.019013 -0.082588 -0.264029 -0.298385 -0.270802 0.378865 -0.018544 -0.224043 -0.267058 0.097113 0.038052 -0.264531 -0.228452 0.282526 -0.135254 -0.216343 0.304431 -0.212224 -0.254096 -0.140780 -0.119891 -0.188144 0.112274 0.094686 0.086492 0.093084 0.095550 0.097492 0.099127 0.097961 0.120145 0.094918 0.093866 0.088477 0.105896 0.095436 0.099456 0.109475 0.110625 0.128261 0.140412 0.158157 0.155460 0.157979 0.145191 0.159094 0.157688 0.157779
qa: -0.2905 -0.4664 -0.3261 0.1312 -0.0190 -0.0826 -0.2640 -0.2984 -0.2708 0.3789 -0.0185 -0.2240 -0.2671 0.0971 0.0381 -0.2645 -0.2285 0.2825 -0.1353 -0.2163 0.3044 -0.2122 -0.2541 -0.1408 -0.1199 -0.1881 0.1123 0.0947 0.0865 0.0931 0.0956 0.0975 0.0991 0.0980 0.1201 0.0949 0.0939 0.0885 0.1059 0.0954 0.0995 0.1095 0.1106 0.1283 0.1404 0.1582 0.1555 0.1580 0.1452 0.1591 0.1577 0.1578
va: 2.1145 2.0233 2.0802 3.7336 3.8336 3.8359 3.9021 3.8961 3.8578 4.0773 3.7111 3.9273 3.9427 3.8141 3.7414 4.0577 3.9751 3.7598 3.9116 3.9187 3.6726 3.9181 4.0091 3.8873 3.8828 3.9076 1.0060 1.0269 1.0045 1.0023 1.0024 1.0157 1.0011 0.9984 1.0008 0.9970 0.9963 1.0072 0.9999 1.0049 0.9976 0.9977 0.9991 1.0349 1.0052 0.9911 0.9970 0.9963 1.0087 0.9902 0.9891 0.9906
dispcorr: -0.023378041 hartree
energy: -1117.890032231135
dipole: -29.41862 30.01619 0.59757 -0.17571 0.10227 -0.07343 -2.50168 1.49745 -1.00424
magnitude: 1.17089 au
magnitude: 2.97616 debye
