program: Orca
programVersion: 5.0.2
elementType: O O O C C C C C C C C C C C C C C C C C C C C C C C H H H H H H H H H H H H H H H H H H H H H H H H H H
charge: 0
multiplicity: 1
keywords: wb97x-d3
keywords: def2-TZVPP
keywords: def2/J RIJCOSX
keywords: DEFGRID2
keywords: scfconv7
keywords: smallprint printgap noloewdin
keywords: NOSOSCF
formula: C23H26O3
InChI: InChI=1/C23H26O3/c1-16(2)13-20-21(23(20,3)4)22(24)25-15-17-9-8-12-19(14-17)26-18-10-6-5-7-11-18/h5-14,20-21H,15H2,1-4H3
52 atoms
O  -1.727461 2.066588 0.088887
O  -2.043625 0.623036 -1.587844
O  3.219622 1.00763 -0.299874
C  -3.373265 -1.200824 0.571148
C  -1.914875 -1.504766 0.727204
C  -2.393187 -0.052575 0.697689
C  -4.252622 -1.417345 1.779782
C  -4.07484 -1.504518 -0.728473
C  -1.099758 -2.10637 -0.350423
C  -2.052946 0.864432 -0.404879
C  -0.514371 -3.307627 -0.289673
C  0.289867 -3.826503 -1.443289
C  -0.604031 -4.244153 0.87571
C  -1.262008 3.07149 -0.799506
C  0.231174 3.026948 -1.000624
C  1.01337 1.982168 -0.525133
C  0.831464 4.084872 -1.677381
C  2.390782 2.005983 -0.719347
C  2.203437 4.091569 -1.87264
C  2.99404 3.058899 -1.393202
C  2.78948 0.077954 0.611778
C  2.353631 0.4550 1.876115
C  2.857026 -1.259236 0.253013
C  1.964041 -0.524041 2.777857
C  2.48352 -2.230151 1.172548
C  2.025696 -1.86796 2.430908
H  -1.626828 -1.80477 1.729529
H  -2.383753 0.432694 1.666612
H  -5.139523 -0.781152 1.739366
H  -3.729096 -1.197838 2.711417
H  -4.591009 -2.45456 1.827094
H  -4.908863 -0.818578 -0.889134
H  -4.487281 -2.514692 -0.684362
H  -3.431091 -1.456777 -1.601883
H  -0.975545 -1.539164 -1.265186
H  0.332833 -3.117156 -2.269809
H  -0.127823 -4.762445 -1.825026
H  1.315762 -4.051186 -1.138338
H  0.38842 -4.593293 1.171521
H  -1.172098 -5.138051 0.602307
H  -1.0814 -3.812796 1.753662
H  -1.538481 4.018312 -0.334054
H  -1.779114 3.021222 -1.760256
H  0.566402 1.152452 0.004849
H  0.227654 4.905581 -2.04624
H  2.668551 4.916542 -2.396699
H  4.066789 3.06663 -1.539753
H  2.31429 1.500756 2.155184
H  3.202361 -1.537543 -0.734873
H  1.617823 -0.232122 3.760938
H  2.54325 -3.274818 0.895892
H  1.725522 -2.627618 3.140666
elementType: O C H
totalener: -1117.86607934 hartree
nucrepener: 2366.22632150 hartree
electener: -3484.09240084 hartree
oneelecener: -6222.38037034 hartree
twoeener: 2738.28796949 hartree
cpcmener: -0.02611963 hartree
kineticenergy: 1112.79065466 hartree
xcener: -110.230562831161 hartree
chargesum: 0.0000000
charge: -0.293091 -0.460199 -0.325371 0.166810 -0.012043 -0.120013 -0.264547 -0.290114 -0.288202 0.374069 -0.037007 -0.231004 -0.267674 0.082563 0.017520 -0.213543 -0.259931 0.327518 -0.102598 -0.268494 0.301379 -0.199165 -0.248787 -0.132690 -0.116287 -0.192730 0.109509 0.097803 0.094419 0.087137 0.093905 0.102523 0.094743 0.097800 0.127006 0.092834 0.103629 0.084425 0.087430 0.111532 0.092838 0.128160 0.116418 0.116735 0.141402 0.155029 0.143134 0.155699 0.143046 0.157812 0.162292 0.156369
qa: -0.2931 -0.4602 -0.3254 0.1668 -0.0120 -0.1200 -0.2645 -0.2901 -0.2882 0.3741 -0.0370 -0.2310 -0.2677 0.0826 0.0175 -0.2135 -0.2599 0.3275 -0.1026 -0.2685 0.3014 -0.1992 -0.2488 -0.1327 -0.1163 -0.1927 0.1095 0.0978 0.0944 0.0871 0.0939 0.1025 0.0947 0.0978 0.1270 0.0928 0.1036 0.0844 0.0874 0.1115 0.0928 0.1282 0.1164 0.1167 0.1414 0.1550 0.1431 0.1557 0.1430 0.1578 0.1623 0.1564
va: 2.1204 2.0276 2.0890 3.7261 3.7596 3.9403 3.9001 3.9073 3.7788 4.1147 3.7452 3.9166 3.9343 3.8410 3.6765 3.9109 3.9880 3.7098 3.8912 3.9983 3.6675 3.9286 3.9981 3.8742 3.8173 3.8805 1.0042 1.0295 1.0025 1.0050 1.0023 1.0001 1.0018 1.0142 1.0218 1.0069 0.9986 0.9979 0.9988 0.9999 1.0082 0.9910 1.0134 1.0211 1.0006 0.9892 1.0099 0.9961 1.0094 0.9897 0.9817 0.9932
dispcorr: -0.028864939 hartree
energy: -1117.894944278158
dipole: -15.69788 15.16138 -0.53650 -21.82268 21.60548 -0.21720 3.88445 -2.58914 1.29531
magnitude: 1.41875 au
magnitude: 3.60616 debye
